program: Gaussian 09
title: 000237040
version: EM64L-G09RevD.01
frameworkgroup: C1[X(C6H11NO3)]
method: RPBEPBE
basis: SDD
operation: Freq
keyword: #p
keyword: freq=noraman
keyword: PBEPBE/SDD
title: #p freq=noraman PBEPBE/SDD
converged: YES YES NO NO
title: Mulliken charges:
elementType: O O O N C C C C C C H H H H H H H H H H H
charge: -0.444116 -0.411101 -0.262578 -0.124855 -0.181228 -0.529700 -0.118152 -0.383210 -0.627227 0.240014 0.256303 0.222531 0.269252 0.234609 0.184402 0.256408 0.241077 0.232351 0.199175 0.367233 0.378812
chargesum: 0.00000
title: Mulliken charges with hydrogens summed into heavy atoms:
elementType: O O O N C C C C C C
charge: -0.076883 -0.032289 -0.262578 -0.124855 0.075076 -0.037917 0.116457 0.057600 0.045376 0.240014
polarizability: 8.95892519e+01 2.40980876e+00 8.28322936e+01 -1.82892419e-01 2.34854172e+00 6.53679837e+01
1716.lowfreq: -14.2040 -10.5771 -0.0007 -0.0006 -0.0005 9.3881 63.4813 77.0438 125.1379
frequency: 63.3994 76.9813 125.1272 159.1474 176.9484 228.3804 275.5071 316.9540 367.4341 382.8883 410.1205 555.6134 587.0832 611.8149 625.8520 705.4360 751.4827 791.6760 821.6976 843.3593 900.2291 945.4562 977.6201 1033.9791 1060.9883 1073.3954 1083.9519 1109.9159 1149.5512 1174.8941 1199.0880 1204.4933 1235.1574 1252.4424 1299.5748 1306.6607 1322.0155 1340.0340 1363.4603 1415.9677 1436.7538 1454.7903 1470.5951 1477.2628 1484.9430 1635.0131 2867.3838 2878.9606 2990.1018 3024.5040 3025.5996 3042.5180 3069.1352 3081.2388 3097.8082 3383.3829 3498.6181
redmass: 6.0226 3.3693 3.2767 5.6648 1.1606 3.3273 5.3449 2.8106 4.9110 2.2424 2.6503 3.2234 1.2043 1.5531 3.1908 3.2052 3.5987 3.4003 3.4777 4.2171 2.1945 2.4725 2.1807 2.2415 1.9720 1.7216 1.8157 1.3204 1.2442 1.7873 1.2479 2.3708 2.2357 1.6047 1.3518 1.7166 1.4426 1.5524 1.9088 1.1762 1.1517 1.0883 1.0572 1.0559 1.0766 7.5801 1.0573 1.0694 1.0848 1.0737 1.0645 1.0902 1.0880 1.1008 1.1025 1.0673 1.0639
irintensity: 1.0983 0.2423 3.2167 2.7115 1.2846 8.6736 1.5743 3.6011 10.5092 3.3383 3.7278 57.8172 95.6491 80.5559 5.1443 106.2851 0.6088 17.7911 16.1152 6.0776 6.1137 3.5043 55.8255 21.8611 166.6874 100.7779 93.8838 15.3005 6.5017 30.6326 30.1487 29.6028 13.9483 4.4690 2.3495 10.8405 5.3125 0.8360 31.7492 59.9295 1.2174 15.9171 19.2369 9.9916 3.8802 211.4226 90.2962 159.9702 27.2530 46.4527 19.0120 27.5719 54.0811 20.1943 14.2495 143.5875 20.9563
temp: 298.150 k
press: 1.00000 atm
elementType: 8 8 8 7 6 6 6 6 6 6 1 1 1 1 1 1 1 1 1 1 1
symmnumber: 1
zpe: 450061.4 jmol-1
zpe.correction: 0.171419 hartree
zpe.thermalcorrener: 0.181634 hartree
zpe.thermalcorrenthalpy: 0.182578 hartree
zpe.thermalcorrgfe: 0.135754 hartree
zpe.sumelectzpe: -514.844571 hartree
zpe.sumelectthermal: -514.834356 hartree
zpe.sumelectthermalent: -514.833412 hartree
zpe.sumelectthermalfe: -514.880237 hartree
dipole: -2.0177 2.8527 2.0566
dipole: 4.0544
quadrupole: -57.2099 -62.6508 -59.3067
quadrupole: 6.8144 5.6428 -3.1678
quadrupole: 2.5126 -2.9283 0.4158 6.8144 5.6428 -3.1678
hfenergy: -515.0159904 hartree
pointgroup: C01 [X(C6H11N1O3)]
dipole: 0.6733438 -0.9167459 1.1183233 debye
dipolederiv: -0.4301389 -0.0535143 0.0377597 -0.0509091 -0.6555727 0.073092 -0.0128972 0.1220785 -0.7236253 -1.2380784 0.2426679 -0.1794277 0.3337614 -0.4338595 -0.0128973 -0.1001281 -0.0464026 -0.2734788 -0.7633044 0.052612 0.0718615 0.1180348 -0.7009798 0.278414 -0.05163 0.5117027 -0.6933115 -0.6428521 -0.0677241 0.0902008 -0.0256896 -0.6937038 0.1159679 -0.0214387 -0.0819591 -0.4372303 0.1863577 0.1930986 0.0854055 0.132069 0.2881235 0.0588572 -0.0268317 -0.0223299 0.2930499 -0.0557579 -0.0137251 -0.1265192 -0.0381855 -0.0361414 -0.0386825 -0.0905341 0.0115905 -0.0394901 0.3298706 0.0697559 -0.0707813 0.0502899 0.4631434 -0.1240067 -0.0110025 -0.1631699 0.5691278 0.6045638 0.0722678 -0.0218981 -0.0487337 -0.1826046 0.0087753 0.0567693 -0.0345504 0.2305213 0.0539595 -0.1119924 -0.0482746 -0.0256967 0.5732615 -0.1782213 -0.0524353 -0.1301314 0.3491024 1.5189218 -0.1747457 -0.0624308 -0.3025495 0.7410135 -0.4655669 0.0517892 -0.5301906 0.6484947 -0.0183274 -0.0047343 -0.089737 0.027435 0.0316018 0.0797574 -0.0923415 0.0096335 -0.0973928 0.0196965 0.0122923 0.0598846 -0.0030982 0.0895613 0.0655349 0.0567856 0.019137 -0.1283118 0.0580535 -0.063688 -0.0139554 -0.0393035 -0.0924816 -0.0282347 -0.0016446 0.015486 0.1010041 -0.1338269 0.051516 0.079602 0.0539085 0.0320845 0.0029145 0.0587052 0.0091786 0.0176847 -0.1743789 -0.0693672 0.0789225 -0.0982405 -0.015209 0.1017462 0.1778026 0.1248742 -0.0940004 -0.0173938 -0.0118916 -0.0501344 -0.0542073 0.0428757 -0.0633359 -0.1069865 -0.072912 -0.0813661 -0.1286986 0.0816688 0.0089061 0.0031377 0.0808867 0.0094276 0.0053525 0.0385686 0.0923142 0.0787544 -0.1077078 -0.0663312 -0.0344124 -0.0672593 -0.073252 -0.059654 -0.1120672 -0.0303726 0.0346193 -0.0464223 0.1095858 -0.0024488 -0.1151274 0.0675047 0.0674935 0.2167782 -0.2135618 0.3974037 -0.0453923 0.0411494 0.0403949 0.330677 0.0062814 0.0353326 -0.0080363 0.3280014 0.3205566 -0.0049743 0.0662117 -0.0355564 0.3197104 0.1159242 0.1174937 0.1227216 0.1828412 unknown
polarizability: 90.04727|1.1352559|79.431944|-1.2132528|-6.8316713|68.3103152 unknown
InChI: InChI=1S/C6H11NO3/c1-7-3-4(8)2-5(7)6(9)10/h4-5,8-9H,2-3H2,1H3
charge 0 multiplicity 1
21 atoms
O  -1.69742 1.459825 -1.171169
O  2.679854 0.032253 0.022369
O  1.188939 1.386308 -1.124363
N  -0.281499 -1.07299 0.102816
C  0.386987 0.047722 0.816342
C  -0.741676 1.066899 1.123104
C  -1.856273 0.738419 0.088262
C  -1.728712 -0.797842 -0.062623
C  0.1386 -2.440373 0.411447
C  1.418699 0.59176 -0.176621
H  0.912035 -0.290484 1.730732
H  -1.115053 0.887479 2.146999
H  -0.420277 2.118325 1.04604
H  -2.857054 1.023451 0.451647
H  -2.335527 -1.312682 0.722628
H  -2.092679 -1.121359 -1.05381
H  1.239422 -2.516536 0.373092
H  -0.270911 -3.135077 -0.343687
H  -0.200306 -2.789417 1.4186
H  -0.723947 1.501324 -1.399016
H  3.2986 0.333194 -0.69859
