program: Gaussian 09
title: 000237044
version: EM64L-G09RevD.01
frameworkgroup: C1[X(C16H11NO2S)]
method: RPBEPBE
basis: SDD
operation: Freq
keyword: #p
keyword: freq=noraman
keyword: PBEPBE/SDD
title: #p freq=noraman PBEPBE/SDD
converged: NO NO NO NO
title: Mulliken charges:
elementType: S O O N C C C C C C C C C C C C C C C C H H H H H H H H H H H
charge: 0.721457 -0.532896 -0.532889 -0.491115 -0.372489 0.532902 -0.141603 0.378784 0.484072 0.429925 -0.463332 -0.452218 -0.245258 -0.344102 -0.401526 -0.426267 -0.249247 -0.192091 -0.249408 -0.243456 0.315488 0.230945 0.244408 0.277992 0.294103 0.233062 0.244854 0.244084 0.236139 0.236142 0.233542
chargesum: 0.00000
title: Mulliken charges with hydrogens summed into heavy atoms:
elementType: S O O N C C C C C C C C C C C C C C C C
charge: 0.721457 -0.532896 -0.532889 -0.175627 -0.372489 0.532902 -0.141603 0.378784 0.484072 0.429925 -0.232388 -0.207811 0.032734 -0.049999 -0.168464 -0.181413 -0.005163 0.044048 -0.013266 -0.009915
polarizability: 3.57291014e+02 1.30701896e+01 2.22807875e+02 -2.24625577e-03 1.71983373e-03 9.45710193e+01
1716.lowfreq: -35.2709 -16.2455 -11.2913 -6.5311 -0.0018 -0.0012 -0.0008 65.1764 74.6046
frequency: -34.9923 65.0923 74.6039 120.7232 134.7574 157.3198 186.7660 198.6329 230.6281 254.6294 285.7933 304.1170 309.6729 350.6325 402.7413 410.1692 435.4687 459.1853 479.5804 520.0513 520.0986 522.7865 531.7895 535.3715 582.4713 621.4591 643.4439 653.7366 655.3016 709.0538 741.1432 754.8027 757.9695 774.2213 796.3974 803.9696 815.7256 845.9809 860.6133 869.4110 918.7412 924.6363 939.9673 950.3136 972.0280 980.0760 991.6231 996.0642 1011.4882 1037.8356 1043.8376 1131.9676 1132.5898 1167.8152 1175.2676 1182.9755 1234.6390 1236.3476 1254.9845 1285.2347 1291.2664 1336.8974 1388.3193 1401.0035 1414.8959 1432.3384 1438.3696 1477.0803 1484.3189 1500.6399 1530.2935 1577.5752 1589.9983 1609.7949 1620.9256 1642.3422 3120.7384 3123.3909 3128.3537 3144.2041 3148.8919 3149.5035 3156.7176 3161.5585 3174.3091 3179.8621 3551.0291
redmass: 7.1355 4.7093 4.6363 7.9032 6.1958 5.5006 4.7780 9.2753 9.9602 4.6719 5.2110 6.2313 7.0632 4.3012 7.9500 3.0886 10.7713 3.2259 8.0821 3.3732 7.1179 7.1815 3.8020 2.7021 1.3810 6.5463 6.7120 3.2375 6.8838 3.4307 6.4519 1.3639 1.3231 3.1182 6.6380 12.9257 1.4565 1.4256 5.7315 1.7098 12.6337 6.5588 1.3852 1.3666 1.4275 1.3340 1.3554 5.2359 7.1756 2.1473 2.1257 1.6984 1.6735 1.2512 1.0569 1.1675 1.7592 2.1939 1.7840 1.7392 2.0053 2.3735 2.9818 3.5924 3.7374 2.6874 3.0167 2.8744 2.5047 3.1793 3.0975 6.8785 4.1745 5.2778 6.3060 7.1650 1.0872 1.0889 1.0875 1.0897 1.0971 1.0886 1.0941 1.0949 1.0998 1.1000 1.0763
irintensity: 2.0301 0.0011 0.4210 0.2029 2.1014 0.1460 2.4540 15.1025 5.3721 1.6092 2.0796 2.5397 4.8635 8.9783 19.9593 6.6888 22.2747 36.8730 33.4689 0.0178 15.0198 0.9262 0.0344 10.3821 34.3808 3.4221 0.9401 0.0919 3.5036 0.2132 0.2075 58.3134 61.2143 33.5360 9.6917 58.1972 78.7785 6.3939 12.5408 21.6614 91.9818 0.1002 0.6435 2.9009 3.3454 0.5283 0.0976 3.2093 5.2878 10.0450 1.0389 12.7095 1.4220 8.6641 1.8521 5.7484 7.0633 15.0198 4.3382 22.6089 19.1355 16.3740 12.3277 10.2382 14.5675 6.3119 0.7637 23.8040 78.3637 76.5090 338.6398 12.3919 86.1451 56.9024 30.0661 57.0498 5.1801 8.0108 3.7357 9.3849 20.7044 10.1125 6.9057 20.8384 16.9771 18.5174 35.0355
temp: 298.150 k
press: 1.00000 atm
elementType: 16 8 8 7 6 6 6 6 6 6 6 6 6 6 6 6 6 6 6 6 1 1 1 1 1 1 1 1 1 1 1
symmnumber: 1
zpe: 596454.2 jmol-1
zpe.correction: 0.227177 hartree
zpe.thermalcorrener: 0.242070 hartree
zpe.thermalcorrenthalpy: 0.243014 hartree
zpe.thermalcorrgfe: 0.185975 hartree
zpe.sumelectzpe: -1218.046380 hartree
zpe.sumelectthermal: -1218.031488 hartree
zpe.sumelectthermalent: -1218.030544 hartree
zpe.sumelectthermalfe: -1218.087582 hartree
dipole: 1.1266 7.3564 -0.0005
dipole: 7.4421
quadrupole: -88.8630 -112.0915 -138.5422
quadrupole: 4.0908 -0.0008 0.0011
quadrupole: 24.3026 1.0741 -25.3766 4.0908 -0.0008 0.0011
hfenergy: -1218.2735574 hartree
pointgroup: C01 [X(C16H11N1O2S1)]
dipole: -0.4630158 -2.8911161 -0.0001995 debye
polarizability: 357.4633343|12.1501408|222.6355542|0.0022345|-0.0017351|94.5710193 unknown
InChI: InChI=1S/C16H11NO2S/c18-20(19)15-8-4-3-7-13(15)17-14-10-9-11-5-1-2-6-12(11)16(14)20/h1-10,17H
charge 0 multiplicity 1
31 atoms
S  -0.608862 1.402749 0.000204
O  -0.445774 2.250839 -1.386629
O  -0.445829 2.250613 1.387179
N  -1.313458 -1.725679 0.000168
C  0.559766 -0.083479 0.00013
C  0.047956 -1.391055 0.000153
C  -2.289203 0.54844 0.000093
C  1.96849 0.199513 0.000102
C  -2.41367 -0.860151 0.000117
C  2.8852 -0.923209 0.000109
C  0.985251 -2.486056 0.000152
C  2.350925 -2.25457 0.000137
C  -3.40415 1.405984 0.000015
C  2.512395 1.526239 0.000069
C  -3.731989 -1.402474 0.000065
C  4.295717 -0.685418 0.000089
C  -4.699996 0.853651 -0.000042
C  -4.852386 -0.555816 -0.000011
C  3.895343 1.723559 0.000049
C  4.798177 0.616925 0.00006
H  -1.526213 -2.724193 0.000179
H  0.596235 -3.511369 0.000168
H  3.045657 -3.101816 0.000142
H  -3.253234 2.490393 -0.000013
H  1.845678 2.392829 0.00004
H  -3.863805 -2.491214 0.000079
H  4.975752 -1.545059 0.000095
H  -5.576904 1.506894 -0.00011
H  -5.854974 -0.995777 -0.00005
H  4.292447 2.743987 0.000019
H  5.878358 0.794519 0.000043
