program: Gaussian 09
title: 000237089
version: EM64L-G09RevD.01
frameworkgroup: C1[X(C20H29Cl2NO)]
method: RPBEPBE
basis: SDD
operation: Freq
keyword: #p
keyword: freq=noraman
keyword: PBEPBE/SDD
title: #p freq=noraman PBEPBE/SDD
converged: NO YES NO NO
title: Mulliken charges:
elementType: Cl Cl O N C C C C C C C C C C C C C C C C C C C C H H H H H H H H H H H H H H H H H H H H H H H H H H H H H
charge: -0.024051 -0.017903 -0.468976 -0.282354 0.051891 0.070148 -0.492053 -0.443601 -0.458417 -0.472292 -0.402372 -0.418929 -0.414250 -0.383926 -0.492890 -0.416625 -0.417881 -0.178433 0.486424 -0.379154 -0.427743 -0.061529 -0.205233 -0.110710 0.187909 0.192705 0.212312 0.220786 0.210745 0.203175 0.206676 0.202915 0.215628 0.229897 0.208474 0.209899 0.198587 0.206910 0.209081 0.204667 0.202982 0.193843 0.243328 0.222519 0.203379 0.204516 0.203924 0.203589 0.192548 0.363929 0.312930 0.238125 0.254883
chargesum: 0.00000
title: Mulliken charges with hydrogens summed into heavy atoms:
elementType: Cl Cl O N C C C C C C C C C C C C C C C C C C C C
charge: -0.024051 -0.017903 -0.105047 -0.282354 0.239800 0.262853 -0.058956 -0.029680 -0.048826 -0.026767 0.016001 -0.013433 -0.000502 0.012899 -0.027043 -0.008731 -0.010367 0.014114 0.486424 -0.066225 -0.189618 -0.061529 0.049651 -0.110710
polarizability: 3.09847692e+02 -1.57732854e+01 2.35280095e+02 1.18493697e+01 2.01578835e+01 1.83385174e+02
1716.lowfreq: -13.3344 -9.1037 -0.0009 -0.0006 0.0013 4.7876 15.0430 17.3234 28.6237
frequency: 13.8772 16.4347 28.5077 30.8912 47.0369 53.8944 74.5437 85.2860 121.3286 132.6363 142.1796 154.7301 169.5468 181.8585 188.9015 205.2880 215.2922 237.0783 263.5083 278.9769 281.8255 307.1761 353.4910 382.7043 403.3000 405.7411 418.8273 430.3085 444.7395 457.7235 468.5092 476.9055 495.0982 519.2276 525.0524 581.0140 591.3546 595.2329 656.1968 687.4886 710.3350 734.6160 756.7982 767.3247 777.6186 796.2472 813.9838 828.7641 841.3461 841.7638 874.0899 878.3819 889.1704 904.5433 908.4823 914.3329 918.7264 924.9827 926.6986 943.6757 950.6369 986.8235 1002.4632 1007.3655 1040.0492 1042.5504 1044.1685 1064.2895 1075.3468 1085.3467 1090.9035 1101.8750 1104.4329 1108.9278 1112.1319 1116.0318 1135.9054 1143.1833 1146.7043 1180.7838 1189.3999 1196.0508 1215.1183 1225.1914 1231.7162 1243.9152 1249.9835 1255.1583 1258.1752 1266.1907 1269.7864 1290.4086 1295.9600 1302.7211 1306.7198 1311.4935 1315.5685 1328.4939 1330.8071 1333.3013 1336.2006 1336.8126 1339.0844 1340.5706 1341.4115 1364.9628 1376.1864 1382.3216 1395.8376 1406.6961 1457.7622 1461.6323 1464.7886 1465.7117 1470.0711 1470.7710 1474.9436 1480.2172 1482.0466 1484.4340 1493.5496 1499.0477 1570.9889 1596.3169 2885.9773 2908.1863 2955.9725 2965.0772 2970.9865 2976.2311 2977.4711 2979.6937 2981.2679 2986.7146 2991.3557 2992.6748 2998.0805 2999.5418 3021.6182 3029.3573 3034.3858 3038.3785 3041.8492 3050.7014 3055.4474 3063.4327 3069.8952 3080.4424 3094.5591 3098.3691 3129.9010 3168.3746 3178.0221
redmass: 6.3879 6.1708 3.1643 4.2900 3.9760 5.1068 2.9037 3.7355 4.6946 2.4600 3.4379 3.7375 2.5150 5.6444 9.3404 3.3002 3.5902 1.6547 2.0078 4.4745 3.5116 7.0459 3.1014 3.0965 2.9264 3.8028 6.4900 2.7938 3.2579 3.5441 4.4271 4.5442 2.7161 3.1747 2.1187 2.7970 3.9310 2.7375 6.7704 4.7553 3.3996 1.5854 1.2343 1.5634 1.6366 1.2797 1.4281 2.9608 2.7846 2.4498 1.6737 2.2105 1.6429 2.3602 2.5580 1.7960 1.5305 1.9627 2.2172 2.1422 1.3487 2.5708 5.0312 3.2071 3.2329 2.2557 2.7748 2.2278 1.8447 1.8132 1.5310 1.3133 1.7568 1.9590 2.4380 2.5414 2.3685 1.4685 2.4503 1.3003 1.3932 2.1234 1.3434 1.3566 1.2817 1.4200 1.2712 1.2429 1.2723 1.2559 1.1929 1.2624 1.2941 1.3155 1.2170 1.3717 1.3193 1.3310 1.3122 1.4142 1.3122 1.3865 1.3742 1.3928 1.3682 1.4463 5.6688 2.5760 1.3878 1.2833 1.9919 1.2276 1.1329 1.0776 1.0820 1.0830 1.0865 1.0858 1.0897 1.0826 1.0889 1.0882 7.9865 6.7496 1.0823 1.0822 1.0759 1.0748 1.0632 1.0644 1.0607 1.0623 1.0604 1.0628 1.0635 1.0670 1.0633 1.0720 1.0994 1.0976 1.1003 1.1017 1.0963 1.1000 1.1031 1.0994 1.1001 1.0650 1.0902 1.0919 1.0895 1.0952 1.0920
irintensity: 0.0871 0.2929 0.0420 0.0847 0.0566 1.8328 0.1203 0.2750 0.6687 0.3842 1.0463 0.7791 0.2206 0.1445 0.1732 0.7653 4.4036 0.0732 0.6801 0.4746 3.1715 1.0370 0.6835 2.3193 10.2821 1.0052 2.3638 1.2852 5.6880 4.7520 9.5977 12.2546 3.2969 1.6520 1.7213 4.1759 9.8990 10.7363 14.0484 9.9206 5.4286 7.5884 8.5832 8.8700 20.3525 60.1415 32.3540 13.9782 2.5986 5.6206 7.4443 14.6663 0.0297 15.6827 15.1775 5.2987 11.3572 13.3340 9.7067 6.6230 2.7311 3.1814 43.1112 18.8972 28.6897 26.1541 62.7151 1.3753 15.9430 13.1606 10.2837 10.7852 10.3513 19.2106 1.2408 1.8509 6.4219 7.6411 10.0442 1.7000 2.1668 18.7403 3.3518 20.4362 6.4499 5.1032 7.3594 1.0111 2.5019 6.1487 2.8139 10.2831 4.4349 6.6250 2.3399 4.7282 12.4091 0.8072 1.6550 2.4081 1.7663 2.0689 0.5463 3.5804 0.6008 20.6297 4.9278 48.9506 99.0124 34.0955 44.5583 14.9333 13.8154 1.0821 3.7776 4.1983 29.6598 16.2624 3.1693 15.6984 1.2152 1.6143 12.6087 7.1088 47.3397 48.4546 9.4060 42.5764 11.2164 58.5810 18.6435 25.8736 74.9023 39.8372 51.3373 36.4609 35.5425 20.3190 15.5580 30.7886 20.7724 41.2075 64.0430 48.9298 61.7632 65.5746 103.1604 343.7846 32.3928 40.7062 12.5352 3.5278 5.4141
temp: 298.150 k
press: 1.00000 atm
elementType: 17 17 8 7 6 6 6 6 6 6 6 6 6 6 6 6 6 6 6 6 6 6 6 6 1 1 1 1 1 1 1 1 1 1 1 1 1 1 1 1 1 1 1 1 1 1 1 1 1 1 1 1 1
symmnumber: 1
zpe: 1185786.4 jmol-1
zpe.correction: 0.451642 hartree
zpe.thermalcorrener: 0.475676 hartree
zpe.thermalcorrenthalpy: 0.476621 hartree
zpe.thermalcorrgfe: 0.394619 hartree
zpe.sumelectzpe: -1827.732103 hartree
zpe.sumelectthermal: -1827.708069 hartree
zpe.sumelectthermalent: -1827.707124 hartree
zpe.sumelectthermalfe: -1827.789126 hartree
dipole: 6.5410 -1.1491 -2.8212
dipole: 7.2155
quadrupole: -174.7256 -150.8614 -164.8439
quadrupole: 3.6179 3.1350 3.1681
quadrupole: -11.2486 12.6155 -1.3669 3.6179 3.1350 3.1681
hfenergy: -1828.1837449 hartree
pointgroup: C01 [X(C20H29Cl2N1O1)]
dipole: 2.3533229 -0.9609725 -1.2638226 debye
polarizability: 300.4138475|-30.1507498|244.1131654|9.3643381|21.2068687|183.985948 unknown
InChI: InChI=1S/C20H29Cl2NO/c21-18-12-11-15(13-19(18)22)20(24)14-23(16-7-3-1-4-8-16)17-9-5-2-6-10-17/h11-13,16-17,20,24H,1-10,14H2
charge 0 multiplicity 1
53 atoms
Cl -5.004518 2.79045 1.568445
Cl -6.78027 1.032691 -0.578526
O  -0.520174 0.068125 1.984663
N  1.359496 -0.161467 0.155165
C  2.133231 1.041871 -0.338935
C  1.997597 -1.531758 0.035007
C  1.457797 2.381769 0.063126
C  3.5865 1.114185 0.217314
C  2.687769 -1.821554 -1.3270
C  2.916632 -1.922345 1.234244
C  2.046254 3.548638 -0.784124
C  4.232023 2.522942 0.007706
C  2.931915 -3.350886 -1.493235
C  3.927031 -3.039418 0.845206
C  -0.034064 -0.223129 -0.386649
C  3.547166 3.318617 -1.125853
C  3.287889 -4.044177 -0.140331
C  -1.000143 -0.613479 0.794256
C  -2.436485 -0.222771 0.489099
C  -3.002662 0.924751 1.089902
C  -3.212125 -0.982298 -0.422026
C  -4.317656 1.312931 0.769458
C  -4.52832 -0.590915 -0.743594
C  -5.082508 0.561752 -0.147904
H  2.185746 1.003533 -1.4535
H  1.134162 -2.22753 0.079853
H  1.646498 2.548412 1.142142
H  0.361061 2.365203 -0.0516
H  4.219401 0.336229 -0.245101
H  3.548192 0.90409 1.302289
H  3.650203 -1.280989 -1.388108
H  2.061493 -1.449802 -2.161837
H  2.272849 -2.268559 2.06579
H  3.463964 -1.045859 1.612452
H  1.928062 4.493519 -0.220382
H  1.465021 3.663817 -1.719533
H  5.313501 2.410002 -0.195829
H  4.151332 3.110932 0.942758
H  3.749717 -3.505567 -2.222789
H  2.031372 -3.828335 -1.926661
H  4.279918 -3.556821 1.757309
H  4.823531 -2.591027 0.371718
H  -0.336485 0.763702 -0.767503
H  -0.135392 -0.944709 -1.223884
H  3.643106 2.76148 -2.078516
H  4.057224 4.288175 -1.279428
H  2.374375 -4.466376 0.324601
H  3.966687 -4.898635 -0.321048
H  -0.951696 -1.717474 0.940913
H  0.477232 0.14498 1.786228
H  -2.407999 1.485137 1.815942
H  -2.79804 -1.88802 -0.880422
H  -5.132609 -1.172428 -1.445963
