program: Gaussian 09
title: 000237030
version: EM64L-G09RevD.01
frameworkgroup: C1[X(C8H17NO3)]
method: RPBEPBE
basis: SDD
operation: Freq
keyword: #p
keyword: freq=noraman
keyword: PBEPBE/SDD
title: #p freq=noraman PBEPBE/SDD
converged: YES YES NO NO
title: Mulliken charges:
elementType: O O O N C C C C C C C C H H H H H H H H H H H H H H H H H
charge: -0.288372 -0.262638 -0.264527 -0.103937 0.024844 -0.412264 -0.499468 -0.620509 -0.622705 0.275295 -0.509243 -0.508926 0.188737 0.194775 0.270897 0.245502 0.247564 0.218035 0.190731 0.226781 0.188353 0.255743 0.215424 0.206447 0.196121 0.235063 0.243654 0.230901 0.237725
chargesum: 0.00000
title: Mulliken charges with hydrogens summed into heavy atoms:
elementType: O O O N C C C C C C C C
charge: -0.288372 -0.262638 -0.264527 -0.103937 0.213581 0.053408 -0.006403 0.015038 0.036815 0.275295 0.128387 0.203353
polarizability: 1.23810485e+02 -1.70128602e+00 1.03914937e+02 1.89126701e-01 1.42212244e+00 8.82646587e+01
1716.lowfreq: -14.5619 -7.0905 -0.0008 -0.0005 0.0006 10.8802 28.3929 38.2478 51.8563
frequency: 28.0832 38.1066 51.6996 62.8885 78.4471 102.8657 131.9888 156.0676 174.4118 191.0078 221.5612 241.1832 260.3724 270.8003 304.2810 359.9152 380.7436 399.3278 416.4011 468.3414 529.6526 577.6422 716.8720 781.2593 816.7105 842.9997 871.3699 951.4863 982.7606 1022.7629 1033.9262 1039.6307 1055.0974 1088.0642 1092.4610 1107.4909 1111.3905 1132.2640 1140.9030 1148.5852 1151.5314 1189.1015 1243.2773 1263.9431 1275.2488 1306.2785 1327.1533 1352.0805 1376.7410 1419.6205 1421.3779 1432.2308 1433.1842 1440.8943 1451.3801 1457.6609 1463.8686 1464.7225 1467.5790 1474.0301 1477.2207 1479.6612 1487.8872 1633.2498 2850.2470 2865.3178 2893.8108 2919.2551 2930.0191 3003.3691 3008.8914 3009.1279 3017.9409 3020.2074 3072.7448 3077.4411 3087.0648 3097.7956 3104.1433 3104.8392 3147.0049
redmass: 4.1967 4.1100 2.6332 2.7141 2.5332 1.0743 2.3505 3.3999 2.1843 2.4717 1.2375 1.1995 3.0487 2.1761 2.9104 2.8579 2.5847 2.4930 2.4164 2.9954 3.6922 4.1820 4.2185 3.7644 4.7055 2.9435 3.0777 3.6656 3.6330 2.7207 1.9083 1.8121 2.7624 2.5234 1.3163 1.2680 1.2744 1.4730 1.5515 1.4593 1.5245 2.7781 1.3497 2.2084 1.9828 1.3103 1.4941 1.3710 1.3233 1.1728 1.1390 1.1349 1.1319 1.1462 1.0507 1.0620 1.0503 1.0514 1.0821 1.0532 1.0660 1.0527 1.0537 8.5319 1.0569 1.0568 1.0692 1.0801 1.0383 1.0296 1.0742 1.0891 1.0725 1.0745 1.0968 1.0949 1.0994 1.0976 1.0980 1.1043 1.1047
irintensity: 2.3838 1.0246 1.8168 2.2715 2.5370 0.1863 1.4591 0.4823 1.1127 5.1048 0.5918 0.4210 6.8014 10.0326 23.5759 6.5505 2.2157 19.4045 2.6302 1.6445 3.8590 5.3283 7.0902 2.6516 23.8572 4.7664 0.1744 28.3159 0.3391 21.1093 62.8452 22.3856 98.6663 125.5681 24.3259 3.8494 0.6672 62.0261 50.9892 12.0246 33.3442 112.0763 6.4235 4.0383 12.2723 16.2576 59.1273 21.0843 4.4494 16.5708 4.9086 19.0324 3.8966 1.4953 14.1591 9.8238 12.8700 14.1822 6.5451 15.9324 35.1493 7.2410 8.0015 156.8431 88.3928 160.0324 116.1470 40.4012 115.0642 35.8328 44.3012 29.2746 34.2370 56.8785 16.5251 22.7593 25.4907 30.8335 7.6289 27.8585 18.8190
temp: 298.150 k
press: 1.00000 atm
elementType: 8 8 8 7 6 6 6 6 6 6 6 6 1 1 1 1 1 1 1 1 1 1 1 1 1 1 1 1 1
symmnumber: 1
zpe: 646467.7 jmol-1
zpe.correction: 0.246227 hartree
zpe.thermalcorrener: 0.261677 hartree
zpe.thermalcorrenthalpy: 0.262621 hartree
zpe.thermalcorrgfe: 0.202082 hartree
zpe.sumelectzpe: -594.431313 hartree
zpe.sumelectthermal: -594.415863 hartree
zpe.sumelectthermalent: -594.414918 hartree
zpe.sumelectthermalfe: -594.475458 hartree
dipole: 1.4104 1.0375 0.5596
dipole: 1.8382
quadrupole: -62.2255 -70.1224 -75.1452
quadrupole: 3.8679 1.0616 -1.8527
quadrupole: 6.9388 -0.9580 -5.9808 3.8679 1.0616 -1.8527
hfenergy: -594.6775394 hartree
pointgroup: C01 [X(C8H17N1O3)]
dipole: 0.6100766 0.2563638 0.2916965 debye
polarizability: 121.9519223|-5.9958127|105.1989056|2.5133222|2.4370488|88.8392532 unknown
InChI: InChI=1S/C8H17NO3/c1-9(2)6-7(11-3)5-8(10)12-4/h7H,5-6H2,1-4H3
charge 0 multiplicity 1
29 atoms
O  0.20837 1.850705 -0.089958
O  -2.874091 0.157913 0.405981
O  -1.508046 -0.980525 -1.090087
N  1.976007 -1.513028 0.132448
C  0.674561 0.589856 0.512875
C  1.473415 -0.269809 -0.501083
C  -0.579929 -0.130603 1.050628
C  3.273583 -1.342551 0.813422
C  1.960976 -2.681301 -0.77285
C  -1.645698 -0.368865 -0.002352
C  1.253563 2.85938 -0.257098
C  -3.995295 -0.026526 -0.54635
H  1.322044 0.823234 1.390322
H  2.306288 0.33831 -0.928901
H  0.79229 -0.534201 -1.32631
H  -1.018242 0.4442 1.880677
H  -0.231872 -1.114255 1.42099
H  3.224129 -0.502127 1.528637
H  4.117999 -1.140846 0.105307
H  3.519282 -2.256126 1.384717
H  2.689078 -2.598266 -1.61856
H  0.949106 -2.801619 -1.195833
H  2.209664 -3.594913 -0.201784
H  1.984916 2.586468 -1.04467
H  1.799681 3.035004 0.695135
H  0.735057 3.785118 -0.553866
H  -3.77281 0.486267 -1.49705
H  -4.8646 0.423352 -0.046565
H  -4.158725 -1.099344 -0.74522
