program: Gaussian 09
title: 000237016
version: EM64L-G09RevD.01
frameworkgroup: C1[X(C6H8N2O3)]
method: RPBEPBE
basis: SDD
operation: Freq
keyword: #pfreq=noraman
keyword: PBEPBE/SDD
title: #p freq=noraman PBEPBE/SDD
converged: YES YES NO NO
title: Mulliken charges:
elementType: O O O N N C C C C C C H H H H H H H H
charge: -0.380903 -0.444383 -0.261558 -0.381759 0.007014 0.049012 0.117556 0.107769 0.061183 -0.400041 -0.834311 0.362456 0.245233 0.262457 0.297095 0.231367 0.229893 0.374112 0.357807
chargesum: 0.00000
title: Mulliken charges with hydrogens summed into heavy atoms:
elementType: O O O N N C C C C C C
charge: -0.006790 -0.086576 -0.261558 -0.019303 0.007014 0.049012 0.117556 0.107769 0.061183 0.107649 -0.075956
polarizability: 1.15340557e+02 1.30491021e+00 1.03142258e+02 9.53296034e-01 2.56260803e-01 4.95857538e+01
1716.lowfreq: -5.2534 -0.0006 -0.0004 0.0005 3.8341 9.1167 70.1561 101.6249 114.4548
frequency: 70.1416 101.6230 114.4356 153.9370 179.3539 209.3515 279.2935 297.1857 337.3358 360.3471 373.6887 427.5696 485.6413 531.3745 566.7069 587.3226 656.1466 670.8541 743.7394 751.5117 839.2233 916.0458 942.4633 978.5978 998.0891 1041.6564 1091.5477 1105.3297 1149.6847 1182.5747 1233.8793 1285.7572 1313.4343 1339.4879 1374.1587 1403.5221 1439.8557 1456.1561 1469.9829 1488.5247 1551.6527 1576.3133 1633.7377 2958.0434 3019.9750 3030.2783 3085.7867 3092.6664 3467.3829 3558.7490 3571.0367
redmass: 3.5512 2.6256 1.1013 6.1633 6.0002 4.2204 3.0571 2.9311 6.4831 1.3989 3.3872 1.1945 6.9598 9.0169 5.0168 4.4167 7.1154 7.3501 5.0119 5.4252 1.2134 2.2157 2.1197 3.4616 3.2621 1.4457 3.1721 3.3175 1.1826 2.3348 1.7571 3.7981 1.3506 1.2753 1.9385 1.5563 1.9468 1.2980 1.2803 1.0447 7.8538 6.3192 7.9948 1.0392 1.0587 1.0987 1.1058 1.0945 1.0772 1.0650 1.0667
irintensity: 6.4339 4.9910 0.1329 0.9981 14.7214 20.9730 0.3516 14.6667 15.9726 192.0112 10.7511 114.9179 5.1478 1.1326 5.7840 3.3488 9.3436 5.2552 14.1344 4.0062 93.2882 5.4462 95.8386 26.0992 10.3449 1.5719 22.1396 50.1366 5.8644 294.4285 8.9305 3.9887 2.9644 8.3340 119.1090 9.8275 9.2856 14.6509 7.0199 17.8585 81.9341 211.2486 550.2963 30.7962 14.1026 22.9327 7.8854 0.9218 92.5324 38.4486 15.6208
temp: 298.150 k
press: 1.00000 atm
elementType: 8 8 8 7 7 6 6 6 6 6 6 1 1 1 1 1 1 1 1
symmnumber: 1
zpe: 373792.1 jmol-1
zpe.correction: 0.142370 hartree
zpe.thermalcorrener: 0.153113 hartree
zpe.thermalcorrenthalpy: 0.154057 hartree
zpe.thermalcorrgfe: 0.106048 hartree
zpe.sumelectzpe: -567.789145 hartree
zpe.sumelectthermal: -567.778401 hartree
zpe.sumelectthermalent: -567.777457 hartree
zpe.sumelectthermalfe: -567.825466 hartree
dipole: -0.3403 -1.5488 1.2280
dipole: 2.0057
quadrupole: -49.8351 -82.4228 -61.1685
quadrupole: -2.7237 -4.4957 1.0753
quadrupole: 14.6404 -17.9473 3.3069 -2.7237 -4.4957 1.0753
hfenergy: -567.9315147 hartree
pointgroup: C01 [X(C6H8N2O3)]
dipole: 0.2465329 -0.6949807 -0.2808722 debye
dipolederiv: -0.4281146 -0.5987188 0.1683253 -0.4579006 -1.0748623 0.1473536 0.1257597 0.1263499 -0.4395258 -0.8803773 -0.0398346 0.0807162 -0.1206793 -0.4221599 0.2261433 0.1618372 0.233519 -0.3020794 -0.5495595 0.2000407 -0.0693425 0.2863663 -1.2044676 0.2569758 -0.0966181 0.2577189 -0.4562295 -0.8040669 0.4109033 -0.1503995 -0.1254557 -0.6384631 0.1184328 -0.0500733 0.1483999 -0.26218 -1.12188 -0.1869086 -0.022396 -0.3238671 -0.5411198 0.0461515 0.0466307 0.0662285 -0.2591267 0.046016 -0.0726009 0.0401513 0.0303743 -0.9214718 0.2231153 0.0103205 0.2138545 -0.2038593 0.5382202 0.0203185 0.0787893 0.435206 0.7379573 -0.1245137 0.0415741 -0.1635507 0.1119704 0.821746 -0.2391632 0.1193901 -0.387698 1.5003966 -0.40208 0.1690327 -0.3985424 0.3223063 1.0068594 0.3191036 -0.014108 0.4448227 1.3456422 -0.2924865 -0.0643365 -0.3033402 0.252654 0.4436028 0.1003685 -0.1333243 0.1859903 0.3274069 -0.1203068 -0.3252883 -0.1484136 0.3281481 -0.1165812 0.0283211 -0.0293216 -0.0200606 -0.020184 0.0369988 -0.0163364 0.0436356 0.0989383 0.3214512 0.0218296 -0.027101 0.0087426 0.223401 0.0338801 -0.0228306 0.0439815 0.3009182 0.0286966 0.0012631 0.043307 0.0408889 -0.096147 -0.0032735 0.0619904 -0.027615 0.0822265 -0.0020401 -0.0237488 -0.0218865 -0.0812447 0.0883857 -0.0296113 0.0070612 0.0112054 -0.058102 0.1400749 -0.0173939 0.0057265 0.1221027 0.0169175 0.0437587 -0.0334247 0.0306319 0.1169256 -0.0272391 -0.0107346 0.0545214 -0.0512065 0.0990322 0.0620477 0.1111179 0.033301 -0.0705485 -0.0026796 -0.0222345 -0.0382251 -0.0829114 0.0006267 -0.1301507 -0.068031 -0.0916537 0.0001951 0.1467465 0.1338399 -0.0560137 0.1249907 0.3567851 0.0102558 -0.0538892 0.0114424 0.3482499 0.4391247 -0.0246503 -0.0288088 -0.0284606 0.2223244 -0.102691 -0.0044964 -0.0871529 0.0891187 unknown
polarizability: 115.1442791|1.811554|98.5189824|4.315682|-14.7973781|54.4053066 unknown
InChI: InChI=1S/C6H8N2O3/c1-3-5(10)7-4(2-9)8-6(3)11/h7,9,11H,2H2,1H3
charge 0 multiplicity 1
19 atoms
O  -1.515658 -2.384157 0.587069
O  3.413937 0.859354 -0.247064
O  -1.165876 2.304088 -0.699079
N  0.685955 0.97795 -0.137489
N  0.527603 -1.317083 0.473379
C  -1.512242 -0.028551 -0.071074
C  1.241713 -0.219877 0.244406
C  -0.724192 1.171961 -0.334659
C  -0.844462 -1.195431 0.318451
C  2.748199 -0.244868 0.457419
C  -3.01239 0.048346 -0.236244
H  1.315829 1.774374 -0.301906
H  3.132427 -1.241086 0.173318
H  2.970491 -0.079703 1.52556
H  -3.27855 1.069609 -0.55456
H  -3.552543 -0.155207 0.710037
H  -3.388901 -0.649594 -1.010787
H  -2.492697 -2.264182 0.466754
H  3.558655 0.613258 -1.19533
