program: Gaussian 09
title: 000237028
version: EM64L-G09RevD.01
frameworkgroup: C1[X(C14H19NO5)]
method: RPBEPBE
basis: SDD
operation: Freq
keyword: #p
keyword: freq=noraman
keyword: PBEPBE/SDD
title: #p freq=noraman PBEPBE/SDD
converged: YES YES NO NO
title: Mulliken charges:
elementType: O O O O O N C C C C C C C C C C C C C C H H H H H H H H H H H H H H H H H H H
charge: -0.299129 -0.241481 -0.262096 -0.260633 -0.254181 -0.476584 0.111481 0.200772 -0.038783 0.300578 0.122082 -0.530844 -0.792809 -0.764556 -0.508802 0.159160 0.240700 -0.257541 -0.666199 -0.504904 0.334447 0.232482 0.266294 0.241386 0.240746 0.275466 0.259693 0.261340 0.204392 0.259292 0.286987 0.236193 0.216756 0.216197 0.253772 0.220314 0.239766 0.242350 0.235894
chargesum: 0.00000
title: Mulliken charges with hydrogens summed into heavy atoms:
elementType: O O O O O N C C C C C C C C C C C C C C
charge: -0.299129 -0.241481 -0.262096 -0.260633 -0.254181 -0.142137 0.111481 0.200772 -0.038783 0.300578 0.122082 -0.032067 -0.035211 -0.039131 0.037476 0.159160 0.240700 0.195408 0.024084 0.213107
polarizability: 2.82116076e+02 -1.07849417e+01 1.78166205e+02 -4.18807699e+00 1.83700071e+00 1.07052040e+02
1716.lowfreq: -5.5915 -2.6775 -0.0012 -0.0011 -0.0007 3.5416 13.4079 20.4273 32.8432
frequency: 13.3899 20.3886 32.8401 38.8907 44.9212 64.8825 77.1158 83.9612 91.8274 95.1665 105.1775 109.1653 129.9055 153.9646 160.5802 180.2695 187.9077 223.4882 249.0354 259.6997 272.3642 295.3435 315.9266 329.9721 343.2212 403.2124 412.4705 457.7355 476.9496 528.0478 555.7016 579.9892 602.5977 628.4521 638.3326 640.4982 675.1647 717.8334 733.9018 748.9678 785.2369 813.5255 814.5365 837.8474 870.7494 944.5043 976.4152 989.0110 998.7135 1009.5997 1035.9717 1038.3255 1043.8828 1057.6481 1094.5206 1096.2415 1113.2986 1135.5775 1149.1375 1152.6055 1156.0154 1167.5098 1237.5611 1242.1745 1261.8397 1281.1010 1294.5195 1328.4677 1352.9437 1355.5770 1390.9476 1400.4248 1407.6098 1422.8010 1429.0650 1438.5734 1444.9609 1445.3781 1453.0293 1453.2976 1457.3918 1463.6913 1463.9155 1465.7115 1471.4803 1484.7563 1490.8914 1509.2281 1564.0237 1569.1915 1627.4449 1637.6186 2965.9717 2991.3656 2991.5211 2993.0416 3004.7055 3007.6144 3018.6453 3027.1289 3063.6983 3077.7023 3084.2695 3084.6274 3088.4646 3091.0905 3106.5626 3116.1469 3128.0388 3150.6567 3585.4886
redmass: 4.5967 5.3225 3.9949 4.4585 3.4941 4.1239 1.2307 2.8389 1.0930 2.8707 1.2105 2.7411 2.7632 3.0805 3.1255 5.1396 3.7833 1.2749 4.1838 4.4014 3.7055 3.1521 4.4245 3.5333 4.2448 6.4770 4.2935 4.3181 4.3358 2.6287 3.1686 4.0076 4.0339 1.6888 2.1949 5.4897 4.6248 4.1371 3.4836 7.2248 4.3538 1.4015 1.8867 3.9062 3.9043 4.7999 3.7811 1.6687 2.3749 2.2155 4.5103 1.4897 1.5352 2.5943 3.2114 2.1663 1.2677 1.7311 1.4416 1.6830 1.7704 3.2713 2.0887 2.4371 1.5982 1.1131 1.4850 3.8599 1.8431 1.3253 1.2329 1.2265 1.2997 1.1999 3.1414 1.3243 1.0444 1.0988 1.1829 1.0514 1.2463 1.0610 1.0477 1.2716 1.0641 1.0686 2.3034 4.2191 4.2263 7.8165 9.9513 8.7205 1.0594 1.0364 1.0369 1.0385 1.0331 1.0617 1.0985 1.0589 1.0950 1.0952 1.0970 1.0984 1.0999 1.1029 1.1046 1.1053 1.1000 1.1047 1.0805
irintensity: 1.8962 1.5357 0.6303 0.9109 0.6525 0.2872 0.1709 0.4716 0.4871 4.4633 0.0757 2.7740 1.0323 1.0599 5.7269 2.3602 7.7891 2.2342 2.0512 10.3045 18.8049 4.7659 3.1758 35.6511 0.3845 0.2899 7.6681 5.3926 5.0467 1.2509 11.8331 14.0535 1.9354 32.3340 45.2460 12.5592 2.2249 20.8419 7.1813 5.2152 9.4235 3.4559 18.1342 9.3398 15.5758 65.7785 2.0593 9.4689 18.5788 9.2420 417.8621 12.1319 8.6749 91.9337 7.5841 16.8214 0.3587 183.9264 11.2152 64.8707 144.8693 17.0372 35.7475 134.2029 153.6783 3.7947 101.1001 79.3880 50.0689 4.0511 30.0101 38.2219 1.8720 26.5461 102.9544 157.9857 15.1880 22.2309 17.0262 12.6189 51.0007 18.3559 26.2124 44.3724 13.8566 21.4986 1.2285 97.0988 47.4633 286.3231 319.1970 130.1713 30.4385 23.4669 24.7525 8.2361 54.1051 10.3239 9.2618 39.0100 10.4571 6.9585 7.1878 36.6848 19.9039 6.2354 27.6073 31.7784 2.9150 16.8145 61.4641
temp: 298.150 k
press: 1.00000 atm
elementType: 8 8 8 8 8 7 6 6 6 6 6 6 6 6 6 6 6 6 6 6 1 1 1 1 1 1 1 1 1 1 1 1 1 1 1 1 1 1 1
symmnumber: 1
zpe: 815748.4 jmol-1
zpe.correction: 0.310702 hartree
zpe.thermalcorrener: 0.333585 hartree
zpe.thermalcorrenthalpy: 0.334529 hartree
zpe.thermalcorrgfe: 0.254387 hartree
zpe.sumelectzpe: -974.268180 hartree
zpe.sumelectthermal: -974.245297 hartree
zpe.sumelectthermalent: -974.244353 hartree
zpe.sumelectthermalfe: -974.324495 hartree
dipole: -0.1401 -5.1993 1.2067
dipole: 5.3394
quadrupole: -92.1996 -123.9058 -118.3204
quadrupole: -6.8438 -2.6319 -2.0742
quadrupole: 19.2756 -12.4305 -6.8451 -6.8438 -2.6319 -2.0742
hfenergy: -974.5788819 hartree
pointgroup: C01 [X(C14H19N1O5)]
dipole: 0.0700336 2.0919944 0.1774263 debye
polarizability: 281.7053621|-10.7747426|176.3585087|8.4402692|-12.0901365|109.2704494 unknown
InChI: InChI=1S/C14H19NO5/c1-5-20-14(18)12-8(2)13(15-9(12)3)10(16)6-7-11(17)19-4/h15H,5-7H2,1-4H3
charge 0 multiplicity 1
39 atoms
O  -4.396027 0.910949 -0.544872
O  1.664431 -2.141732 0.174318
O  -4.209275 -1.40169 -0.250993
O  6.265471 -0.038039 0.48116
O  4.988969 1.319805 -0.913221
N  -0.211522 1.001978 -0.248381
C  0.048156 -0.381423 -0.074061
C  -1.206588 -1.038762 -0.086126
C  -2.212981 -0.016766 -0.27283
C  -1.559342 1.245575 -0.374193
C  1.409017 -0.897504 0.077216
C  2.551246 0.138192 0.096899
C  -1.4406 -2.515511 0.071358
C  -2.082674 2.636642 -0.579718
C  3.917564 -0.507252 0.373112
C  -3.655233 -0.274983 -0.343873
C  5.062763 0.368263 -0.098751
C  -5.879166 0.746689 -0.614484
C  -6.499685 0.758018 0.785815
C  7.474389 0.704505 0.046801
H  0.506514 1.723646 -0.301927
H  2.337872 0.91806 0.85551
H  2.596874 0.657256 -0.883186
H  -1.938786 -2.927815 -0.825255
H  -2.133651 -2.712875 0.908651
H  -0.489154 -3.041304 0.235087
H  -2.784498 2.91589 0.224501
H  -2.653927 2.707011 -1.521076
H  -1.259743 3.373755 -0.606896
H  4.054998 -0.74908 1.440511
H  3.969637 -1.481311 -0.151856
H  -6.104325 -0.196962 -1.141668
H  -6.208091 1.607868 -1.21895
H  -7.602326 0.722305 0.706311
H  -6.168139 -0.119209 1.365784
H  -6.223267 1.675827 1.333688
H  7.381259 1.772354 0.30681
H  7.610265 0.60843 -1.043514
H  8.30297 0.233303 0.593299
