program: Gaussian 09
title: 000236963
version: EM64L-G09RevD.01
frameworkgroup: C1[X(C20H33N3O3)]
method: RPBEPBE
basis: SDD
operation: Freq
keyword: #p
keyword: freq=noraman
keyword: PBEPBE/SDD
title: #p freq=noraman PBEPBE/SDD
converged: YES YES NO NO
title: Mulliken charges:
elementType: O O O N N N C C C C C C C C C C C C C C C C C C C C H H H H H H H H H H H H H H H H H H H H H H H H H H H H H H H H H
charge: -0.310587 -0.248667 -0.271295 -0.167806 -0.459595 -0.473210 -0.475964 0.132638 -0.312316 -0.320587 -0.343497 0.419258 0.420502 -0.365787 0.143070 -0.353591 0.545183 -0.721449 -0.600929 -0.303861 -0.671233 -0.690467 -0.837866 -0.838029 -0.693216 0.248016 0.238584 0.237929 0.207382 0.196194 0.224611 0.201548 0.183475 0.196085 0.201782 0.229975 0.346347 0.195440 0.202176 0.228940 0.303193 0.231796 0.220393 0.222955 0.215610 0.216147 0.227764 0.213015 0.220626 0.222387 0.238221 0.231907 0.289214 0.212096 0.227959 0.329533 0.211855 0.208694 0.217452
chargesum: 0.00000
title: Mulliken charges with hydrogens summed into heavy atoms:
elementType: O O O N N N C C C C C C C C C C C C C C C C C C C C
charge: -0.310587 -0.248667 -0.271295 -0.167806 -0.113248 -0.143677 0.000549 0.132638 0.091261 0.105571 0.036063 0.419258 0.420502 0.065970 0.143070 0.044025 0.545183 -0.492509 -0.297736 0.148328 -0.016520 -0.029062 -0.145352 -0.108760 -0.055215 0.248016
polarizability: 3.88770733e+02 -6.18104081e+00 2.40386907e+02 -1.50572931e+01 -5.70285523e+00 1.81614330e+02
1716.lowfreq: -19.7986 -12.7652 -4.3938 -0.0017 0.0011 0.0017 1.8528 10.8377 22.2397
frequency: -13.9988 10.0094 21.9176 28.6087 35.3036 42.0631 50.2789 62.6049 73.3938 78.0777 87.1689 91.7404 102.8030 108.9179 119.3285 127.4635 136.9606 148.6830 157.6450 180.6406 191.0607 208.2717 223.9364 226.9138 230.7096 239.0956 251.6331 262.4008 283.6957 291.5316 302.1111 319.7637 326.1504 342.2527 381.3561 392.5173 402.9276 447.0741 466.9810 495.0260 504.6988 517.6745 519.0942 551.9879 569.5967 609.3842 609.8988 643.1915 661.0184 688.5886 698.7824 730.8161 731.7247 755.6741 765.1420 797.1159 798.2187 808.4473 835.2687 845.7825 860.1308 879.8026 896.7897 899.5925 916.4417 926.6738 951.0077 969.0148 975.9161 986.4104 993.2550 996.1687 1014.0333 1040.3012 1045.6810 1050.6306 1056.2433 1062.1807 1064.8728 1073.3873 1073.9437 1088.7456 1112.4930 1118.8482 1148.3925 1157.2106 1166.6038 1181.8111 1195.3323 1200.4038 1213.7254 1241.8851 1246.8019 1249.5911 1261.0506 1271.3212 1278.5887 1285.1800 1287.7580 1296.4650 1317.3181 1325.1762 1328.8777 1353.2861 1361.8698 1367.7625 1369.6820 1384.6844 1388.3118 1390.2504 1393.7588 1396.4223 1398.5697 1422.4024 1443.2774 1448.0410 1451.3204 1455.0028 1463.2567 1466.6007 1468.4100 1470.0127 1470.8989 1472.0989 1476.7866 1476.8404 1478.7592 1480.3436 1482.2157 1485.8536 1488.5305 1493.8890 1501.2851 1526.0629 1600.7052 1623.9003 1632.7157 1665.0153 2883.0035 2891.2863 2956.0010 2956.5782 2965.8998 2969.9859 2972.8717 2977.1702 2984.9332 2989.3196 2989.5149 2998.5586 3018.0438 3021.6173 3025.3240 3043.1509 3043.2600 3047.7968 3051.3509 3057.0183 3069.8657 3072.7579 3079.3401 3083.2596 3084.7506 3090.6045 3091.5021 3092.4199 3096.4657 3108.9267 3179.8221 3295.1393 3542.6839
redmass: 3.2859 4.2917 3.7058 3.5497 1.9931 3.9663 3.7592 5.4683 3.6780 2.3553 3.4951 2.8262 3.2645 2.3149 2.0027 3.1072 3.3343 1.0737 1.5921 1.8476 1.6939 1.8811 3.7595 1.1085 3.0876 2.2702 2.7636 2.6613 2.5365 2.1996 3.6660 3.8241 3.1820 2.8630 5.1308 3.8301 3.5603 2.7164 4.0348 3.6061 4.2567 3.7641 3.3348 4.2292 3.9401 3.8371 3.2146 1.4476 4.2366 4.7629 5.3303 3.2828 1.0739 2.5747 1.1406 1.1468 1.2623 1.1541 3.9686 1.2495 1.5032 2.9163 2.3357 2.4640 1.4535 3.5489 4.2018 1.2162 2.4952 1.8925 2.4993 2.4730 3.5869 1.6871 1.7809 2.3958 1.6295 2.7367 2.5841 1.8777 2.6027 2.1679 1.9215 2.5154 2.9904 1.7577 1.8019 3.1639 2.1562 2.0600 1.3885 1.7736 1.3974 1.2800 1.4855 1.2004 1.1886 1.1839 1.0529 1.1168 1.3555 3.7454 1.4086 1.5720 1.3238 1.3894 1.3830 4.3989 1.2194 1.2311 1.2452 1.3205 1.2773 3.0759 1.7141 1.0981 1.0947 1.0965 1.1042 1.0664 1.0760 1.0741 1.0526 1.0923 1.1285 1.0430 1.2609 1.0733 1.1573 1.1051 1.0907 1.0970 1.8139 2.2320 6.0659 6.0605 7.3050 8.2552 1.0710 1.0714 1.0586 1.0654 1.0397 1.0594 1.0367 1.0369 1.0359 1.0607 1.0359 1.0973 1.0577 1.0894 1.1028 1.0942 1.0943 1.0892 1.1035 1.0967 1.1010 1.0992 1.0983 1.0980 1.0988 1.1004 1.0999 1.0996 1.1084 1.0916 1.0925 1.0758 1.0759
irintensity: 0.3167 0.5255 0.4319 0.5035 0.3564 0.4419 2.3274 3.1482 0.4574 0.5015 0.8324 0.4508 3.1117 0.4212 0.7030 1.3922 1.7380 1.1765 3.0753 2.2244 1.0809 0.7662 3.7461 0.0420 2.6632 5.2335 1.0106 19.6553 1.7938 1.6885 14.5162 3.3693 6.9453 18.9146 1.5630 0.3951 1.8592 1.6594 9.3510 0.4464 3.0762 6.5091 1.2801 8.5902 5.2230 13.6921 8.0812 31.2022 7.0703 10.3640 46.4783 11.9696 10.2791 14.9636 0.0221 8.3784 20.0873 59.1125 3.2479 1.6593 27.7864 4.4926 3.8845 21.1977 22.7120 2.7394 69.3749 0.9321 10.8983 9.1931 160.8410 43.7013 18.6573 14.9900 16.8436 32.8694 8.8893 117.1002 17.8191 25.7605 14.4220 4.5832 21.2128 33.2483 293.2838 40.2284 8.5958 92.0694 143.3830 12.5263 3.6275 4.8682 19.3622 11.4550 20.9897 4.4982 11.9426 16.0943 1.1515 0.8279 1.0698 11.4517 1.4597 0.7225 4.2813 31.7278 15.1108 3.1588 14.7079 16.9338 29.3757 11.3328 24.2769 183.2500 90.8021 5.3115 22.1115 45.0508 38.4372 0.1058 37.8284 1.5956 6.4224 77.7744 29.9000 14.2033 74.8692 0.6162 85.7311 107.6288 24.4314 2.4005 334.7809 366.9007 76.4617 137.0915 160.7196 251.9599 42.3404 175.6248 13.7512 49.6338 43.9797 49.2919 39.1942 22.2251 23.0233 24.4346 24.0888 3.5182 62.3099 16.7029 15.7465 4.0538 22.8365 11.5553 18.8602 14.1045 83.2875 52.1674 42.6634 57.2404 31.0565 37.2466 57.8914 14.1078 37.5430 23.7249 2.4620 294.6727 29.4222
temp: 298.150 k
press: 1.00000 atm
elementType: 8 8 8 7 7 7 6 6 6 6 6 6 6 6 6 6 6 6 6 6 6 6 6 6 6 6 1 1 1 1 1 1 1 1 1 1 1 1 1 1 1 1 1 1 1 1 1 1 1 1 1 1 1 1 1 1 1 1 1
symmnumber: 1
zpe: 1323525.7 jmol-1
zpe.correction: 0.504104 hartree
zpe.thermalcorrener: 0.533667 hartree
zpe.thermalcorrenthalpy: 0.534611 hartree
zpe.thermalcorrgfe: 0.440447 hartree
zpe.sumelectzpe: -1169.860513 hartree
zpe.sumelectthermal: -1169.830950 hartree
zpe.sumelectthermalent: -1169.830006 hartree
zpe.sumelectthermalfe: -1169.924170 hartree
dipole: 2.9697 4.2378 1.2616
dipole: 5.3263
quadrupole: -109.4077 -156.7846 -164.6671
quadrupole: 0.4722 5.6095 -7.2379
quadrupole: 34.2121 -13.1648 -21.0473 0.4722 5.6095 -7.2379
hfenergy: -1170.3646174 hartree
pointgroup: C01 [X(C20H33N3O3)]
dipole: -1.1782977 1.5878152 -0.6940962 debye
polarizability: 387.2031632|1.8982939|240.6806264|-24.271031|-3.185882|182.8881803 unknown
InChI: InChI=1S/C20H33N3O3/c1-6-9-10-11-26-20(25)21-17-12-15(4)19(16(5)13-17)22-18(24)14-23(7-2)8-3/h12-13,21-22H,6-11,14H2,1-5H3
charge 0 multiplicity 1
59 atoms
O  4.549742 1.417069 -1.140398
O  -2.884103 -1.690941 2.099157
O  3.523469 -0.708788 -1.052515
N  -5.750447 -0.011693 0.487318
N  -3.057077 -0.163833 0.300704
N  2.340355 1.319193 -0.699202
C  -5.099279 -1.159974 1.174205
C  -1.683454 0.164889 0.056276
C  -6.919038 -0.412796 -0.351646
C  -6.062936 1.079448 1.461939
C  7.957202 -0.203736 -0.278827
C  -1.309546 1.542061 0.045492
C  -0.717819 -0.848686 -0.214997
C  6.558242 0.415381 -0.049145
C  -3.560086 -1.027513 1.257825
C  8.68489 -0.535848 1.044136
C  1.006947 0.885838 -0.458223
C  0.03142 1.885871 -0.215485
C  0.624737 -0.475889 -0.460578
C  5.863749 0.757296 -1.373739
C  -6.505596 -1.141105 -1.643609
C  -6.335555 2.443538 0.803081
C  -2.335003 2.6276 0.318042
C  -1.099537 -2.31263 -0.2774
C  10.081123 -1.155973 0.821999
C  3.455062 0.542938 -0.963174
H  -5.471938 -1.315827 2.209132
H  -5.306972 -2.092489 0.617811
H  -7.465247 0.506194 -0.627124
H  -7.63116 -1.045143 0.232448
H  -5.184967 1.174616 2.128535
H  -6.925826 0.793836 2.112317
H  8.583772 0.494418 -0.872957
H  7.859789 -1.129824 -0.882435
H  6.651534 1.33475 0.561363
H  5.925751 -0.295185 0.516117
H  -3.82251 0.339799 -0.18553
H  8.780492 0.38914 1.648583
H  8.05854 -1.232038 1.637564
H  0.321599 2.944646 -0.21759
H  1.373923 -1.243256 -0.666487
H  5.701169 -0.151935 -1.980723
H  6.433706 1.502958 -1.953373
H  -5.848658 -0.498171 -2.255346
H  -5.96471 -2.082696 -1.438723
H  -7.400655 -1.396468 -2.240124
H  -5.489914 2.738499 0.157277
H  -7.253015 2.441425 0.18846
H  -6.463337 3.217118 1.582196
H  -3.075965 2.709603 -0.502099
H  -2.899898 2.420863 1.245864
H  -1.851325 3.613324 0.422287
H  -1.299317 -2.703724 0.736806
H  -2.028056 -2.458407 -0.861285
H  -0.297067 -2.908918 -0.742211
H  2.517811 2.325668 -0.676237
H  10.009801 -2.099952 0.249568
H  10.735602 -0.468041 0.253883
H  10.580288 -1.381002 1.782299
