program: Gaussian 09
title: 000236932
version: EM64L-G09RevD.01
frameworkgroup: C1[X(C17H11Cl2NO2)]
method: RPBEPBE
basis: SDD
operation: Freq
keyword: #p
keyword: freq=noraman
keyword: PBEPBE/SDD
title: #p freq=noraman PBEPBE/SDD
converged: YES YES NO NO
title: Mulliken charges:
elementType: Cl Cl O O N C C C C C C C C C C C C C C C C C H H H H H H H H H H H
charge: -0.007665 -0.034684 -0.288406 -0.254500 -0.005115 0.336073 -0.037411 0.172271 0.065791 -0.369808 0.337340 -0.321943 -0.230884 -0.144245 -0.264430 0.179001 -0.362264 -0.374739 -0.228540 -0.247003 -0.235833 -0.496884 0.271685 0.327100 0.284829 0.290537 0.218194 0.231148 0.228090 0.232193 0.235625 0.247349 0.247128
chargesum: 0.00000
title: Mulliken charges with hydrogens summed into heavy atoms:
elementType: Cl Cl O O N C C C C C C C C C C C C C C C C C
charge: -0.007665 -0.034684 -0.288406 -0.254500 -0.005115 0.336073 -0.037411 0.172271 0.065791 -0.098124 0.337340 0.005157 -0.230884 -0.144245 0.020399 0.179001 -0.071727 -0.156545 0.002609 -0.018913 -0.003640 0.233218
polarizability: 3.95144592e+02 6.96968250e+00 2.66893069e+02 -4.24123057e-02 -4.68438150e-01 8.39683024e+01
1716.lowfreq: -4.6839 -4.3631 -0.0025 0.0006 0.0008 2.9489 20.6248 26.1883 32.7425
frequency: 20.4831 26.1688 32.7387 65.5919 78.0137 91.2225 111.4610 121.9339 133.1636 169.4228 186.2074 198.1566 205.7994 213.7167 240.4150 281.6520 293.2004 354.6687 364.8983 392.3340 401.3777 426.4290 432.5948 450.9534 480.8603 550.6927 561.1365 572.2207 606.7081 615.2668 625.5823 682.5985 696.3259 701.4540 737.5428 742.1738 789.5755 795.6500 801.7300 830.9343 855.1308 869.6300 870.4301 921.5511 924.0909 940.0879 941.9641 988.8685 989.6384 1014.8787 1018.1605 1024.1868 1062.4702 1086.4262 1095.5682 1114.5359 1143.7410 1147.2506 1173.4844 1189.9328 1197.5051 1230.7748 1278.8601 1306.5853 1322.0399 1337.2156 1351.2526 1377.4788 1390.8810 1419.4315 1424.3584 1441.0110 1451.6120 1462.4802 1477.2060 1497.7321 1524.2086 1571.5443 1587.5374 1591.9630 1611.6215 1619.8827 3007.9571 3111.0155 3127.7930 3137.3372 3149.7035 3153.5846 3161.0727 3171.0334 3183.5060 3190.2955 3202.1716
redmass: 3.9114 6.3828 8.7381 4.3730 6.1911 1.2379 6.2311 6.1066 4.7486 17.5457 4.5143 5.0393 7.3285 5.5409 7.2319 7.9884 6.0841 8.0626 6.7000 9.5913 2.8139 10.6718 6.3123 5.1320 4.1092 7.3047 5.6197 4.4753 6.4348 6.4962 7.5332 3.4226 1.7417 7.1324 7.1010 9.2724 2.1912 4.3308 6.9499 7.8336 1.2699 7.4953 1.4189 1.4379 8.3798 1.4375 1.5564 6.0165 1.3708 1.3431 6.1302 2.6326 2.5103 1.7442 1.9452 1.2623 5.9985 1.5429 1.0616 1.2230 1.6375 1.9203 2.5954 2.8355 1.8619 4.4107 3.0945 5.3496 9.8412 2.9442 1.2706 2.5401 1.0493 1.0525 3.3684 3.3982 8.4871 7.8236 6.1595 7.5023 6.1510 9.2423 1.0295 1.1047 1.0848 1.0882 1.0932 1.1050 1.0961 1.1000 1.0936 1.0930 1.0908
irintensity: 0.0988 0.3702 0.9963 0.4521 0.6301 0.2113 0.4409 0.0054 0.2051 0.2298 0.8897 13.8226 0.4147 0.0361 2.6290 0.1065 5.9563 20.1153 0.8774 6.2828 0.0245 8.7618 4.8870 0.8810 3.5422 0.9133 2.5975 8.2914 21.3322 0.8038 1.4635 2.4843 47.8666 21.6371 36.1379 44.9512 40.5349 0.0035 26.8732 10.7198 0.8691 25.0055 22.8787 14.9355 18.1651 23.0664 0.0891 1.0597 0.0597 0.7883 17.3387 21.6120 7.3634 3.7751 64.0913 0.0421 335.7877 108.9036 4.7631 29.8155 31.7423 92.5629 25.4319 56.2674 1.9023 73.1712 9.0328 21.9290 4.6631 13.0952 26.9089 22.6933 15.1181 12.4683 40.6237 7.0086 128.0221 127.2655 6.7833 88.5507 3.3742 81.5467 36.0978 22.3225 1.7839 6.1646 28.9101 12.4643 17.7600 30.1721 0.9544 25.9440 0.3671
temp: 298.150 k
press: 1.00000 atm
elementType: 17 17 8 8 7 6 6 6 6 6 6 6 6 6 6 6 6 6 6 6 6 6 1 1 1 1 1 1 1 1 1 1 1
symmnumber: 1
zpe: 613228.1 jmol-1
zpe.correction: 0.233566 hartree
zpe.thermalcorrener: 0.252830 hartree
zpe.thermalcorrenthalpy: 0.253774 hartree
zpe.thermalcorrgfe: 0.183121 hartree
zpe.sumelectzpe: -1778.224775 hartree
zpe.sumelectthermal: -1778.205511 hartree
zpe.sumelectthermalent: -1778.204567 hartree
zpe.sumelectthermalfe: -1778.275220 hartree
dipole: 3.0157 3.4377 -0.0032
dipole: 4.5729
quadrupole: -134.9787 -120.1172 -144.0867
quadrupole: 5.7805 0.0576 -0.1734
quadrupole: -1.9178 12.9437 -11.0258 5.7805 0.0576 -0.1734
hfenergy: -1778.4583409 hartree
pointgroup: C01 [X(C17H11Cl2N1O2)]
dipole: -0.8984963 1.5502976 0.1617801 debye
polarizability: 387.3577627|-31.7491726|271.9310381|4.0154529|21.894865|86.7171625 unknown
InChI: InChI=1S/C17H11Cl2NO2/c1-22-17(21)13-9-15(10-5-3-2-4-6-10)20-16-12(13)7-11(18)8-14(16)19/h2-9H,1H3
charge 0 multiplicity 1
33 atoms
Cl 0.261125 -4.117032 -0.589603
Cl 5.381245 -2.090072 -0.220033
O  1.090615 3.43063 0.323664
O  3.154313 2.378761 0.235202
N  -0.578122 -1.245126 -0.27083
C  1.705588 -0.25415 -0.098233
C  0.787551 -1.377214 -0.252978
C  1.085234 1.049191 0.038448
C  -1.134228 -0.015344 -0.14001
C  -0.310507 1.148954 0.015681
C  -2.622284 0.061215 -0.169125
C  3.117999 -0.483768 -0.089206
C  1.358263 -2.692445 -0.393356
C  3.58904 -1.785012 -0.229997
C  2.732776 -2.91089 -0.383991
C  1.90101 2.297864 0.202791
C  -3.373125 -1.134386 -0.348985
C  -3.323266 1.290069 -0.023614
C  -4.780536 -1.10057 -0.383939
C  -4.733396 1.321781 -0.058584
C  -5.4691 0.128104 -0.239328
C  1.814429 4.713784 0.490004
H  -0.756128 2.138342 0.118164
H  3.800237 0.359529 0.026636
H  3.144295 -3.917195 -0.491383
H  -2.822832 -2.073636 -0.458369
H  -2.783043 2.231554 0.119561
H  -5.343072 -2.030176 -0.5239
H  -5.257624 2.276971 0.055577
H  -6.564083 0.154745 -0.266667
H  1.023402 5.473029 0.559536
H  2.469576 4.896489 -0.377917
H  2.426546 4.688707 1.406882
