program: Gaussian 09
title: 000236942
version: EM64L-G09RevD.01
frameworkgroup: C1[X(C22H14ClNO2)]
method: RPBEPBE
basis: SDD
operation: Freq
keyword: #p
keyword: freq=noraman
keyword: PBEPBE/SDD
title: #p freq=noraman PBEPBE/SDD
converged: YES YES NO NO
title: Mulliken charges:
elementType: Cl O O N C C C C C C C C C C C C C C C C C C C C C C H H H H H H H H H H H H H H
charge: -0.053618 -0.443658 -0.252014 -0.039676 -0.283130 0.313802 0.312866 0.162949 0.052819 0.333801 -0.379124 -0.393416 -0.417525 0.359215 -0.255048 -0.369574 -0.414128 0.114647 -0.363512 -0.371434 -0.247620 -0.237166 -0.220773 -0.228296 -0.243213 -0.115210 0.273441 0.302687 0.256276 0.233133 0.257550 0.244241 0.295020 0.227239 0.228602 0.226202 0.257555 0.255655 0.229768 0.390667
chargesum: 0.00000
title: Mulliken charges with hydrogens summed into heavy atoms:
elementType: Cl O O N C C C C C C C C C C C C C C C C C C C C C C
charge: -0.053618 -0.052991 -0.252014 -0.039676 -0.283130 0.313802 0.312866 0.162949 0.052819 0.333801 -0.105682 -0.090730 -0.161249 0.359215 -0.021916 -0.112024 -0.169887 0.114647 -0.068492 -0.144195 -0.019018 -0.010964 0.036782 0.027359 -0.013445 -0.115210
polarizability: 4.16253199e+02 9.35324408e+00 3.54882424e+02 1.68728469e+01 -9.45807967e+00 1.16191368e+02
1716.lowfreq: -5.4775 -2.6269 -0.0016 0.0007 0.0014 2.2638 22.8053 26.9075 38.4765
frequency: 22.6226 26.9067 38.4741 42.6878 44.1438 64.5850 91.4732 113.3724 127.6207 164.9344 185.8754 206.6401 222.7002 242.2770 248.4385 286.7940 309.9104 344.2533 354.1541 374.8616 403.5079 408.0969 413.6749 439.7012 460.0698 478.2407 495.7334 548.2374 559.3197 578.1199 582.7115 599.2077 611.7659 617.9548 623.5709 626.8214 666.7178 689.2191 700.0855 723.0489 725.8630 746.2327 767.7015 783.5788 802.5218 824.7583 834.3178 839.2104 846.3637 852.1442 863.3797 915.0908 934.5897 936.2961 956.2524 967.0612 970.4179 988.4819 992.0505 995.0577 998.0401 1002.3646 1025.8417 1054.8252 1061.6292 1074.3307 1081.2004 1092.9124 1112.4673 1142.3400 1172.8665 1185.0940 1193.8206 1196.8030 1220.7100 1270.5429 1285.8442 1293.3241 1299.5377 1312.1778 1325.7031 1339.1692 1364.3940 1373.1584 1375.7494 1398.1813 1408.7887 1432.0168 1442.7171 1478.2175 1486.2878 1505.7613 1540.3098 1577.8968 1579.2261 1583.6156 1595.4057 1602.6938 1610.1434 1636.7921 3122.0071 3129.6660 3134.6133 3143.2137 3147.8963 3154.9837 3157.5792 3159.3725 3172.2124 3175.1870 3176.2921 3190.1699 3200.4507 3530.5768
redmass: 3.7711 6.4853 9.3593 6.6016 7.8096 4.6189 6.5975 5.7295 6.1994 8.4388 4.3949 6.6914 6.5696 7.1879 8.6411 5.2475 5.6000 5.7318 5.0238 9.5154 2.9658 2.9080 4.6121 9.3574 4.7227 3.4487 3.9555 3.3237 5.2526 4.8282 2.5232 6.3429 1.9506 4.8913 6.1166 6.9979 6.5685 4.1510 1.7068 6.4771 3.1946 4.8428 2.1230 1.8228 6.1120 1.4115 4.6611 2.7406 1.2974 1.4529 7.1788 1.4040 1.5750 1.4528 1.3668 5.8810 1.4442 5.1056 1.3612 2.4990 1.7502 1.3339 2.5863 3.1545 2.9904 2.5760 1.7870 1.7849 1.4049 1.9919 1.0524 1.1685 1.1441 1.2286 1.9478 2.7189 2.0551 2.1873 1.3905 1.7721 3.7577 2.9767 5.2017 5.9292 6.2227 4.3785 2.6605 2.6239 2.8534 2.7808 2.6300 3.8450 7.1607 7.3300 5.9746 6.9410 6.0586 6.1583 6.1476 8.5212 1.0849 1.0882 1.0877 1.0937 1.0883 1.0948 1.0886 1.0983 1.0961 1.0971 1.0974 1.0951 1.0909 1.0642
irintensity: 0.0290 0.4012 0.8792 0.0214 0.0336 0.0371 0.5566 2.5820 0.0483 0.7604 3.0349 0.2714 0.5204 0.8781 3.2141 1.3839 0.0870 1.6202 2.3705 1.4009 0.3010 0.2030 0.9092 27.1939 5.7022 7.2948 18.7885 15.5719 6.6882 22.3519 33.9932 57.4596 76.4582 11.9938 11.8641 4.4622 4.6002 11.8037 67.2049 16.3320 4.2619 9.1403 60.4503 42.4996 2.9750 10.1904 2.7023 26.6158 11.9232 39.2723 12.8908 0.7525 6.0847 7.2311 0.6771 68.4351 1.6059 0.5679 0.1764 39.0028 11.4959 2.2348 86.6785 92.4350 130.6727 43.4016 32.0377 15.6222 2.7321 85.7138 0.0045 16.1327 8.9431 4.6117 6.2706 15.1629 2.8686 53.2023 1.1845 3.1609 57.5495 50.7329 32.4731 1.6457 13.1341 7.3319 8.9540 10.7737 17.3263 84.5206 10.2751 9.8961 130.3388 7.8694 1.8029 63.2982 9.4751 24.2400 0.6451 209.7270 3.7826 4.5136 11.2767 22.9590 7.7706 20.4320 0.4900 44.4559 5.3807 4.9200 5.9356 13.3620 0.2532 64.7612
temp: 298.150 k
press: 1.00000 atm
elementType: 17 8 8 7 6 6 6 6 6 6 6 6 6 6 6 6 6 6 6 6 6 6 6 6 6 6 1 1 1 1 1 1 1 1 1 1 1 1 1 1
symmnumber: 1
zpe: 775222.1 jmol-1
zpe.correction: 0.295267 hartree
zpe.thermalcorrener: 0.316167 hartree
zpe.thermalcorrenthalpy: 0.317111 hartree
zpe.thermalcorrgfe: 0.242895 hartree
zpe.sumelectzpe: -1510.277510 hartree
zpe.sumelectthermal: -1510.256609 hartree
zpe.sumelectthermalent: -1510.255665 hartree
zpe.sumelectthermalfe: -1510.329881 hartree
dipole: -1.2411 -0.7997 0.1044
dipole: 1.4801
quadrupole: -161.9862 -132.0967 -159.3882
quadrupole: -9.4469 4.5613 -2.5439
quadrupole: -10.8292 19.0604 -8.2311 -9.4469 4.5613 -2.5439
hfenergy: -1510.5727765 hartree
pointgroup: C01 [X(C22H14Cl1N1O2)]
dipole: 0.468565 0.3424671 0.0474583 debye
polarizability: 409.2194027|20.0037903|349.7382319|-41.5692616|39.4943345|128.369356 unknown
InChI: InChI=1S/C22H14ClNO2/c23-16-11-9-15(10-12-16)20-13-19(22(25)26)18-8-4-7-17(21(18)24-20)14-5-2-1-3-6-14/h1-13,25H
charge 0 multiplicity 1
40 atoms
Cl -6.71858 -0.887206 0.411184
O  0.151493 4.884608 0.780854
O  2.420428 4.584665 0.476169
N  0.055992 -0.056221 0.054609
C  1.399404 0.24461 -0.012819
C  1.899413 1.609537 0.119459
C  2.324604 -0.849049 -0.252379
C  0.90452 2.63562 0.364783
C  -0.855656 0.921178 0.272262
C  1.878068 -2.267792 -0.37495
C  -0.448681 2.283676 0.441582
C  3.302502 1.855221 -0.008246
C  3.690164 -0.542099 -0.379645
C  -2.288016 0.510121 0.315961
C  4.172649 0.791504 -0.261618
C  0.943294 -2.848399 0.526398
C  2.438932 -3.094505 -1.388157
C  1.274941 4.074537 0.532589
C  -2.638819 -0.824331 -0.032499
C  -3.325063 1.404304 0.697996
C  0.588596 -4.209915 0.419164
C  2.077267 -4.454434 -1.501269
C  -3.978778 -1.256107 -0.007166
C  -4.672085 0.986321 0.73099
C  1.150969 -5.020069 -0.595326
C  -4.980252 -0.340622 0.375332
H  -1.181103 3.072662 0.614068
H  3.677144 2.874918 0.094409
H  4.403825 -1.357519 -0.539741
H  5.247139 0.982362 -0.356133
H  0.504462 -2.230643 1.314018
H  3.139393 -2.659001 -2.110383
H  -1.837411 -1.508906 -0.325499
H  -3.100926 2.435869 0.986724
H  -0.124793 -4.64003 1.131239
H  2.512271 -5.068191 -2.298037
H  -4.241139 -2.281731 -0.282064
H  -5.464683 1.678245 1.0295
H  0.869851 -6.075845 -0.679306
H  0.460464 5.82476 0.880746
