program: Gaussian 09
title: 000239210
version: EM64L-G09RevD.01
frameworkgroup: C1[X(C11H9BrO2)]
method: RPBEPBE
basis: SDD
operation: Freq
keyword: #p
keyword: freq=noraman
keyword: PBEPBE/SDD
title: #p freq=noraman PBEPBE/SDD
converged: NO NO NO NO
title: Mulliken charges:
elementType: Br O O C C C C C C C C C C C H H H H H H H H H
charge: 0.072936 -0.219843 -0.184218 -0.547753 0.296419 -0.293870 -0.484913 0.142659 0.396167 -0.350801 -0.349853 -0.217399 -0.217143 -0.230630 0.260031 0.259952 0.232188 0.232253 0.250077 0.250175 0.234369 0.234341 0.234854
chargesum: 0.00000
title: Mulliken charges with hydrogens summed into heavy atoms:
elementType: Br O O C C C C C C C C C C C
charge: 0.072936 -0.219843 -0.184218 -0.027770 0.296419 0.170572 -0.484913 0.142659 0.396167 -0.100724 -0.099679 0.016970 0.017198 0.004224
polarizability: 1.75582098e+02 -5.76711463e+00 1.41790655e+02 7.26940299e-02 2.21324212e-01 1.01334113e+02
1716.lowfreq: -71.7926 -26.2061 -10.1790 -0.0008 -0.0007 -0.0006 5.4338 10.5025 62.3158
frequency: -71.7226 -26.0131 62.3123 62.5429 99.4731 129.4297 154.9065 232.5807 249.3576 274.6921 304.5166 395.3433 482.3432 509.6935 576.2154 617.8129 620.4539 637.6901 692.8281 695.7860 700.1633 749.2475 815.2431 821.3169 843.5599 853.4834 927.7881 944.5911 977.8121 985.4164 990.7359 999.8208 1022.0063 1025.9676 1046.3711 1077.9196 1170.5300 1174.7568 1174.9120 1186.7511 1205.3630 1231.9687 1280.5031 1308.5074 1345.1836 1366.9424 1427.5458 1464.0543 1472.4111 1490.1844 1579.5208 1600.8166 1646.2284 1691.2594 3010.0421 3035.3890 3057.5135 3100.5851 3127.7021 3133.1926 3144.2308 3153.6570 3167.8000
redmass: 2.0219 3.8795 5.8274 4.9504 8.4195 13.9000 4.3651 7.0364 5.2602 9.1653 4.7475 2.8269 5.2493 4.7173 7.7672 7.8602 6.9596 8.1400 6.8909 5.1314 1.9334 1.9952 4.5616 1.3026 5.8583 1.2448 1.4805 4.5376 1.3864 5.9548 5.3297 1.3355 4.9761 2.2154 1.6259 1.6096 8.4905 1.0872 1.0803 1.1182 1.1127 3.9432 1.4124 1.3795 1.3164 6.6020 2.1923 1.0953 2.1871 1.0859 5.8752 6.1249 11.4174 12.8877 1.0601 1.0587 1.1039 1.1101 1.0849 1.0879 1.0927 1.0970 1.1018
irintensity: 1.8033 0.0439 0.8147 3.8706 0.2980 1.6983 3.0887 2.3937 0.3527 8.2865 0.0123 0.0023 4.0057 5.7555 4.8590 6.2474 0.5369 36.8730 3.7551 9.1621 39.2034 101.7629 12.9058 1.1163 20.2802 0.0008 0.4552 55.1078 0.0134 54.2838 123.4983 0.5472 42.0050 38.5022 0.0519 9.5937 143.7254 0.3482 0.2036 1.1254 0.9403 33.7626 3.4300 0.3094 2.5964 0.1688 9.0419 5.7975 18.3825 1.9831 1.5882 10.9406 142.8589 227.1951 12.1769 58.0630 1.6619 25.4285 1.0391 0.2521 11.0734 27.3952 19.8148
temp: 298.150 k
press: 1.00000 atm
elementType: 35 8 8 6 6 6 6 6 6 6 6 6 6 6 1 1 1 1 1 1 1 1 1
symmnumber: 1
zpe: 444574.0 jmol-1
zpe.correction: 0.169329 hartree
zpe.thermalcorrener: 0.180346 hartree
zpe.thermalcorrenthalpy: 0.181291 hartree
zpe.thermalcorrgfe: 0.130506 hartree
zpe.sumelectzpe: -587.462566 hartree
zpe.sumelectthermal: -587.451549 hartree
zpe.sumelectthermalent: -587.450605 hartree
zpe.sumelectthermalfe: -587.501389 hartree
dipole: 5.3933 -4.6399 0.0080
dipole: 7.1145
quadrupole: -100.2982 -84.4438 -82.6657
quadrupole: 3.3855 0.0250 0.0746
quadrupole: -11.1623 4.6921 6.4702 3.3855 0.0250 0.0746
hfenergy: -587.6318954 hartree
pointgroup: C01 [X(C11H9Br1O2)]
dipole: -2.027642 1.9210372 -0.1819555 debye
dipolederiv: -0.1244168 0.098828 -0.0100128 0.0771432 -0.8058202 0.0611872 -0.009067 0.0629891 0.0072075 -0.7223416 -0.446822 0.0233147 -0.1776208 -1.1732101 0.0597805 0.00288 0.0535322 -0.2978416 -0.8013486 0.1755438 -0.0232018 0.3246661 -0.8086058 0.0433401 -0.035081 0.0407557 -0.3029972 -0.0240316 0.0489321 -0.00677 -0.1128319 -0.1208653 0.0156811 0.0047239 0.0189889 0.1259333 -1.0481481 -0.3130567 0.0006718 -0.0159174 -0.2642975 0.0183307 -0.0193458 0.0128979 -0.0129567 0.2909643 -0.1582331 0.0099487 0.0817752 0.5993413 -0.016343 -0.0074839 -0.0216407 0.3535592 0.786245 -0.1010166 0.0273716 0.0769407 1.2890753 -0.1044686 0.0125234 -0.1103944 -0.1596741 1.6780472 0.5906997 -0.0123981 -0.239058 1.4607488 -0.0923034 0.0504944 -0.0748998 0.2543367 -0.0309591 0.0237838 -0.0032284 -0.0679283 -0.1840104 0.0139523 0.0036208 0.0169039 0.0299357 -0.0986741 -0.0489467 -0.0808532 -0.0057495 -0.1096672 0.0522761 0.0686689 0.0062605 0.0448014 -0.0981397 -0.0380146 0.0805388 -0.0101135 -0.114398 -0.0311797 -0.073903 0.0126993 0.050844 -0.0642621 -0.0174591 0.100325 -0.0299142 -0.1196672 -0.0209632 0.07567 -0.0341184 0.0802506 -0.0560798 -0.0331339 -0.1032598 -0.042272 -0.10952 0.0437076 -0.0769979 0.0584342 0.0615632 0.0855706 -0.0800361 0.0080991 -0.0723898 -0.1279486 0.0039218 0.0075598 0.0033737 -0.0424348 0.0331033 0.0261022 -0.0732281 0.017637 0.0323598 0.0191507 -0.0842344 0.0665443 -0.0223314 0.0267957 0.0394108 0.0702592 0.0303859 0.0191552 -0.0235737 0.0822851 -0.0706081 -0.0028072 0.0411121 0.0071748 0.0294549 -0.0375659 -0.0405693 0.0665636 0.0662487 0.1353544 -0.0631629 0.0448752 0.0087505 -0.0265044 -0.0436044 -0.0701262 -0.0675702 -0.056189 -0.1341356 -0.037336 0.0660827 0.0377665 0.0849687 0.0384655 0.1133214 -0.034514 0.074857 -0.0273711 -0.0142183 0.0735342 0.0255128 -0.0848147 0.027012 0.1195423 0.018014 -0.0748384 0.0106031 -0.0271906 0.0248334 0.0310297 -0.0766045 0.0390888 0.147137 0.0134387 -0.0944317 0.0158364 -0.0653863 0.0169023 0.0426456 0.0755054 0.0524579 0.1398033 -0.038083 0.0921867 -0.0413846 -0.0504783 -0.0996645 0.0805384 -0.0095821 0.089393 0.1282213 -0.0003454 -0.0101468 -0.0006206 0.0903838 unknown
polarizability: 174.8939678|-7.2917978|142.1691247|1.9836781|-3.410714|101.6437736 unknown
InChI: InChI=1S/C11H9BrO2/c12-10(8-4-2-1-3-5-8)9-6-7-14-11(9)13/h1-5H,6-7H2
charge 0 multiplicity 1
23 atoms
Br 0.441478 -2.752518 0.239271
O  3.514865 0.886852 0.039153
O  3.313112 -1.418889 0.201339
C  1.162657 1.562705 -0.061442
C  1.299815 0.050895 0.050619
C  2.631753 2.075725 -0.066706
C  0.237417 -0.801437 0.090809
C  2.758431 -0.314185 0.108993
C  -1.184185 -0.354248 0.029316
C  -1.836705 -0.213786 -1.224304
C  -1.892648 -0.053085 1.222905
C  -3.176753 0.230193 -1.281975
C  -3.232578 0.390491 1.160539
C  -3.877452 0.533985 -0.090785
H  0.624693 1.850867 -0.981839
H  0.58649 1.977624 0.784417
H  2.901095 2.594517 -1.001151
H  2.862158 2.725245 0.79347
H  -1.296609 -0.461646 -2.14509
H  -1.395573 -0.175406 2.191887
H  -3.673859 0.333633 -2.252868
H  -3.773047 0.618834 2.085878
H  -4.918155 0.873636 -0.136639
