program: Gaussian 09
title: 000239188
version: EM64L-G09RevD.01
frameworkgroup: C1[X(C11H15NO3)]
method: RPBEPBE
basis: SDD
operation: Freq
keyword: #p
keyword: freq=noraman
keyword: PBEPBE/SDD
title: #p freq=noraman PBEPBE/SDD
converged: YES YES NO NO
title: Mulliken charges:
elementType: O O O N C C C C C C C C C C C H H H H H H H H H H H H H H H
charge: -0.326605 -0.269120 -0.273182 -0.469192 0.048845 -0.685422 -0.680850 0.516175 -0.595048 0.365078 -0.397122 0.257710 -0.385750 -0.173650 -0.537423 0.234440 0.209564 0.232290 0.220547 0.211723 0.254898 0.216535 0.235049 0.326336 0.300610 0.251245 0.226720 0.219195 0.219139 0.247266
chargesum: 0.00000
title: Mulliken charges with hydrogens summed into heavy atoms:
elementType: O O O N C C C C C C C C C C C
charge: -0.326605 -0.269120 -0.273182 -0.142856 0.283285 -0.023022 0.002305 0.516175 -0.359999 0.365078 -0.096512 0.257710 -0.134505 0.053069 0.148178
polarizability: 2.11519753e+02 -1.39413032e+00 1.43328803e+02 1.55709985e+00 -2.06260496e+00 7.90582112e+01
1716.lowfreq: -6.7689 0.0001 0.0004 0.0006 2.1741 7.0636 37.1643 42.0518 73.7887
frequency: 36.7314 41.9407 73.7823 77.8371 97.2460 103.6453 168.3011 194.9040 199.2876 217.1749 243.2369 249.2260 261.9840 269.8043 345.4363 372.6254 395.0241 440.1676 451.0552 453.0556 534.4852 598.2526 599.1438 642.5753 690.3817 691.6676 700.1651 731.9842 791.6733 827.0345 842.5011 888.3196 900.3525 905.6261 926.7005 941.0268 976.4891 981.7766 990.5531 1025.6416 1085.2789 1104.5660 1110.7532 1154.1745 1156.3583 1159.5710 1169.6671 1185.4678 1194.7588 1276.3386 1312.2265 1322.7313 1339.2408 1380.8142 1394.0849 1396.3247 1411.8087 1439.4605 1456.9085 1464.8570 1466.6010 1469.7586 1473.2446 1487.6041 1492.7616 1524.3216 1607.5412 1614.5130 1660.8662 2954.4911 2987.8939 2992.3733 3026.9085 3040.6742 3083.2393 3093.2964 3097.4917 3102.8973 3123.3898 3138.9342 3141.5021 3175.6418 3198.3379 3544.5246
redmass: 3.1531 4.1161 5.5736 4.0175 3.9140 4.1431 3.4057 1.0227 1.6376 2.8021 1.4022 3.8085 3.3359 1.9525 4.6413 3.4711 3.1788 4.5703 2.7968 2.7573 4.9847 4.0035 3.6665 1.5849 1.9572 7.1205 5.7418 4.8775 1.2769 4.1536 2.0213 5.2262 1.3840 2.7881 1.2344 1.3688 6.4767 1.3109 8.0458 3.6255 1.5054 1.8365 1.2610 2.2312 1.4640 2.1281 1.2776 1.8696 1.7950 2.5879 1.4819 1.3951 1.3239 1.2650 4.8018 1.2991 2.6868 1.2362 1.0537 1.0488 1.0503 1.1326 1.0509 1.0528 2.3640 2.1523 5.9042 6.0019 8.5369 1.0333 1.0356 1.0358 1.0865 1.1038 1.0994 1.0988 1.1006 1.1006 1.0987 1.0905 1.0887 1.0951 1.0951 1.0759
irintensity: 0.0425 0.1501 2.6060 0.4440 10.0974 1.1477 1.9311 0.0344 0.0112 5.2479 0.2572 4.2533 15.8791 0.8052 1.2074 2.0643 8.1856 2.7129 2.6843 6.3473 4.5327 7.1350 7.7984 28.9547 26.0988 4.5768 49.5043 3.7760 27.3897 26.4421 89.7525 38.4636 2.8919 37.7276 2.7572 0.1866 41.1790 4.0532 107.5637 123.9803 29.5039 237.1076 0.2863 183.9445 12.5324 113.6207 123.2833 5.5739 120.0663 77.7400 18.2376 8.6956 10.0147 34.1221 146.9920 8.1347 102.3196 8.1255 6.0976 6.9951 13.2938 107.0256 2.7211 15.7944 118.4286 354.7332 43.6050 293.5544 211.8803 57.8693 16.6508 26.0579 6.5663 52.0657 7.5688 57.6600 19.8692 33.6574 25.8450 16.8659 8.1930 6.0586 5.1583 24.8217
temp: 298.150 k
press: 1.00000 atm
elementType: 8 8 8 7 6 6 6 6 6 6 6 6 6 6 6 1 1 1 1 1 1 1 1 1 1 1 1 1 1 1
symmnumber: 1
zpe: 639362.2 jmol-1
zpe.correction: 0.243520 hartree
zpe.thermalcorrener: 0.259156 hartree
zpe.thermalcorrenthalpy: 0.260100 hartree
zpe.thermalcorrgfe: 0.199808 hartree
zpe.sumelectzpe: -707.466223 hartree
zpe.sumelectthermal: -707.450588 hartree
zpe.sumelectthermalent: -707.449644 hartree
zpe.sumelectthermalfe: -707.509936 hartree
dipole: -1.1420 -3.7760 0.3070
dipole: 3.9568
quadrupole: -79.8077 -81.8175 -92.1551
quadrupole: -2.8052 0.1827 -0.3620
quadrupole: 4.7857 2.7760 -7.5617 -2.8052 0.1827 -0.3620
hfenergy: -707.7097435 hartree
pointgroup: C01 [X(C11H15N1O3)]
dipole: -0.4737908 -1.4531675 0.2953132 debye
polarizability: 211.461726|-2.7110086|142.1125943|-0.3769308|-9.2428677|80.3324474 unknown
InChI: InChI=1S/C11H15NO3/c1-8(2)15-11(13)12-9-5-4-6-10(7-9)14-3/h4-8,12H,1-3H3
charge 0 multiplicity 1
30 atoms
O  -2.774512 -0.682344 -0.005616
O  4.324673 -0.958949 0.135601
O  -1.979143 1.512924 -0.361363
N  -0.544936 -0.349135 -0.022808
C  -4.191204 -0.179863 -0.066828
C  -5.025077 -1.382109 -0.515069
C  -4.5863 0.377501 1.308191
C  0.755938 0.220595 -0.109486
C  1.853549 -0.669524 0.058815
C  3.172812 -0.169307 -0.015179
C  0.976996 1.598664 -0.349947
C  -1.767608 0.292396 -0.149173
C  3.409644 1.207749 -0.254806
C  2.309071 2.06845 -0.418229
C  4.143167 -2.389526 0.383481
H  -4.213135 0.628904 -0.821004
H  -6.085834 -1.087945 -0.610956
H  -4.677046 -1.759555 -1.491708
H  -4.956926 -2.201739 0.22204
H  -5.632328 0.734836 1.284286
H  -3.940335 1.227824 1.584265
H  -4.503959 -0.40584 2.082636
H  1.663619 -1.732629 0.243785
H  -0.610156 -1.354687 0.148483
H  0.128397 2.271947 -0.478689
H  4.441207 1.566558 -0.306719
H  2.486614 3.13344 -0.603998
H  3.611111 -2.881182 -0.454904
H  3.593892 -2.569917 1.328695
H  5.160809 -2.798837 0.464702
