program: Gaussian 09
title: 000239187
version: EM64L-G09RevD.01
frameworkgroup: C1[X(C11H14O4)]
method: RPBEPBE
basis: SDD
operation: Freq
keyword: #pfreq=noraman
keyword: PBEPBE/SDD
title: #p freq=noraman PBEPBE/SDD
converged: YES YES NO NO
title: Mulliken charges:
elementType: O O O O C C C C C C C C C C C H H H H H H H H H H H H H H
charge: -0.265532 -0.288401 -0.312005 -0.300914 -0.135223 0.340648 -0.327185 -0.302341 0.043059 -0.375110 0.223780 -0.213034 -0.354199 -0.528743 -0.527443 0.257942 0.233590 0.216543 0.226557 0.217737 0.266155 0.227275 0.251255 0.238847 0.255808 0.225044 0.259716 0.219172 0.227002
chargesum: 0.00000
title: Mulliken charges with hydrogens summed into heavy atoms:
elementType: O O O O C C C C C C C C C C C
charge: -0.265532 -0.288401 -0.312005 -0.300914 0.122719 0.340648 0.122948 0.141953 0.043059 -0.108955 0.223780 0.014242 -0.102945 0.190957 0.178446
polarizability: 1.65818321e+02 -4.02069002e+00 1.38836210e+02 -6.18158485e-01 -5.84940641e+00 8.41452562e+01
1716.lowfreq: -7.5316 0.0001 0.0008 0.0009 8.6996 13.9129 35.1697 49.3780 77.7794
frequency: 35.0464 49.3574 77.7746 82.2333 99.0347 125.6387 151.7376 161.6054 178.8583 208.6171 234.7872 266.1758 276.7746 315.0800 353.5712 414.0743 441.5172 528.8563 564.0074 578.2586 594.3143 611.8818 664.7528 725.7351 757.7529 785.4549 802.5446 832.4475 858.7984 863.9706 905.9284 919.5747 936.9643 948.0155 975.4001 980.1615 991.3118 1048.9988 1063.2573 1111.0316 1113.3578 1119.1668 1147.2780 1154.7243 1159.0449 1166.1607 1169.8497 1196.1062 1233.8433 1241.3941 1257.7750 1319.0618 1323.4272 1328.4126 1368.3022 1415.2065 1425.7439 1447.1502 1456.9278 1459.8240 1463.7923 1469.0947 1474.5084 1476.8099 1485.6129 1589.6580 1595.2007 2973.8513 2976.6927 2987.9913 2997.8437 3056.5476 3075.0517 3080.5659 3090.5472 3104.3394 3119.3181 3122.5443 3137.5858 3161.0010 3173.2758
redmass: 3.4286 4.5355 4.3028 2.9073 2.6391 3.9218 1.2338 3.2072 1.0880 3.5966 2.8872 3.7965 5.8348 4.9135 4.7428 5.4024 6.0028 5.4719 5.1624 4.1408 5.3086 2.4223 7.7599 5.8875 2.7749 2.7968 2.9440 3.7564 2.9548 4.3082 4.8477 1.4641 4.2444 4.9302 2.8870 1.3213 4.9634 3.6565 2.1367 1.7161 1.2399 1.2423 1.5165 1.3283 1.1352 1.2155 2.5055 1.2837 1.9368 1.5793 2.0676 1.3433 1.3365 1.2483 5.5544 1.4154 1.3338 1.9071 1.8095 1.2461 1.0677 1.0901 1.0988 1.0626 1.0539 7.3688 7.0418 1.0318 1.0294 1.0679 1.0616 1.0876 1.1017 1.1058 1.1010 1.1026 1.1032 1.1036 1.0867 1.0923 1.0978
irintensity: 8.4053 1.8185 1.2834 6.1151 7.1419 0.1840 1.2694 1.8573 0.4733 17.5243 6.5671 7.1441 1.9524 7.5775 2.6739 5.1914 3.7859 9.5495 1.3597 2.9038 3.6137 7.2817 3.9721 38.8254 9.7268 61.6408 51.9488 26.1116 7.4236 7.7164 11.4013 13.5751 50.9244 37.5250 13.2445 1.7274 136.4990 60.8404 47.0588 5.8335 10.5016 1.6160 10.6444 0.6977 0.7620 3.7933 35.5301 17.7615 47.4855 44.1540 101.7068 13.4561 31.4523 0.3724 18.7049 14.7777 3.2447 88.5539 9.0506 32.7930 0.9820 5.8789 3.4158 10.1598 15.3589 10.5566 1.6190 85.7923 51.3137 44.4919 80.7130 18.3330 27.1952 16.0523 23.3219 32.8353 24.6566 21.6412 7.4978 5.6043 14.0393
temp: 298.150 k
press: 1.00000 atm
elementType: 8 8 8 8 6 6 6 6 6 6 6 6 6 6 6 1 1 1 1 1 1 1 1 1 1 1 1 1 1
symmnumber: 1
zpe: 607917.6 jmol-1
zpe.correction: 0.231544 hartree
zpe.thermalcorrener: 0.246459 hartree
zpe.thermalcorrenthalpy: 0.247403 hartree
zpe.thermalcorrgfe: 0.188737 hartree
zpe.sumelectzpe: -727.254469 hartree
zpe.sumelectthermal: -727.239554 hartree
zpe.sumelectthermalent: -727.238610 hartree
zpe.sumelectthermalfe: -727.297276 hartree
dipole: -1.2571 -0.1664 -1.0984
dipole: 1.6777
quadrupole: -73.0153 -82.5891 -91.0946
quadrupole: -2.2311 8.5933 -1.3073
quadrupole: 9.2177 -0.3561 -8.8616 -2.2311 8.5933 -1.3073
hfenergy: -727.4860128 hartree
pointgroup: C01 [X(C11H14O4)]
dipole: 0.4915469 -0.0668447 0.4354035 debye
polarizability: 165.9565636|3.5069257|138.8868778|-0.235056|4.931469|83.9563458 unknown
InChI: InChI=1S/C11H14O4/c1-12-9-5-3-4-8(10(9)13-2)11-14-6-7-15-11/h3-5,11H,6-7H2,1-2H3
charge 0 multiplicity 1
29 atoms
O  2.016435 -1.261689 0.438339
O  2.705609 0.388924 -1.130298
O  -1.028327 -1.558611 -0.509015
O  -3.306923 0.014917 0.341497
C  1.556842 -0.440025 -0.726408
C  0.372252 0.437534 -0.357072
C  3.188778 -0.544049 0.987543
C  3.859784 -0.003314 -0.28571
C  -0.899664 -0.176432 -0.226536
C  0.504048 1.823865 -0.110919
C  -2.033459 0.59492 0.152523
C  -0.616347 2.584157 0.292355
C  -1.882602 1.972862 0.424282
C  -1.122743 -2.409744 0.704633
C  -3.90165 -0.624771 -0.856063
H  1.30123 -1.175381 -1.507361
H  3.790119 -1.284224 1.537318
H  2.869395 0.27459 1.662397
H  4.471661 0.899953 -0.130362
H  4.451564 -0.787502 -0.795726
H  1.483286 2.288915 -0.255867
H  -0.508461 3.656164 0.489553
H  -2.767674 2.5415 0.727193
H  -1.982941 -2.09848 1.325858
H  -0.178536 -2.341146 1.273735
H  -1.270488 -3.435526 0.333247
H  -3.237838 -1.412806 -1.251596
H  -4.092083 0.137406 -1.635792
H  -4.855067 -1.053706 -0.511646
