program: Gaussian 09
title: 000239180
version: EM64L-G09RevD.01
frameworkgroup: C1[X(C10H14N2O2)]
method: RPBEPBE
basis: SDD
operation: Freq
keyword: #p
keyword: freq=noraman
keyword: PBEPBE/SDD
title: #p freq=noraman PBEPBE/SDD
converged: YES YES NO NO
title: Mulliken charges:
elementType: O O N N C C C C C C C C C C H H H H H H H H H H H H H H
charge: -0.338022 -0.212355 -0.440499 0.006111 0.048848 -0.681006 -0.686176 0.207416 0.486962 -0.530957 0.269904 -0.314205 -0.794948 -0.329046 0.233507 0.210123 0.257037 0.214839 0.208679 0.231331 0.219514 0.226110 0.333964 0.231224 0.226012 0.238015 0.237330 0.240287
chargesum: 0.00000
title: Mulliken charges with hydrogens summed into heavy atoms:
elementType: O O N N C C C C C C C C C C
charge: -0.338022 -0.212355 -0.106535 0.006111 0.282355 0.000993 -0.026651 0.207416 0.486962 -0.304847 0.269904 -0.082981 -0.093591 -0.088759
polarizability: 2.05874539e+02 -4.27138323e-01 1.27189536e+02 -1.70575076e+00 -3.61531734e+00 7.58856897e+01
1716.lowfreq: -15.9687 -3.7286 -0.0008 -0.0008 -0.0005 4.4082 13.8139 41.3378 50.5914
frequency: 5.4001 41.2988 50.5884 62.6331 78.0105 102.1704 185.9003 194.3683 207.5307 218.6477 230.4617 242.2709 284.5339 364.5032 392.1919 397.0430 443.6129 452.7687 507.2160 582.4341 627.0738 642.2444 700.2574 707.6638 743.3063 754.8413 830.0146 841.1521 877.8272 887.6907 907.7837 926.5749 941.9725 956.0804 960.3422 980.7566 1025.9647 1048.0819 1100.6891 1108.9166 1134.4216 1156.1677 1183.6008 1188.5924 1272.1762 1314.0060 1322.0741 1338.1452 1348.7828 1375.4465 1380.0556 1395.6452 1399.2057 1456.1353 1457.3255 1465.0094 1468.1785 1472.5901 1475.0997 1487.4488 1509.7331 1571.1233 1598.0839 1695.0263 2982.5700 2987.5031 2991.5068 3022.2335 3063.9959 3082.3322 3089.8657 3091.9231 3097.4503 3103.0127 3117.7401 3128.7266 3156.2214 3549.5786
redmass: 3.6942 3.0759 1.1355 4.7401 4.1695 4.7859 2.0922 1.2318 3.5463 4.0026 3.5840 1.2402 4.3071 3.2849 3.4303 3.2025 2.8083 2.5922 5.7292 3.1974 6.4488 1.4317 6.2938 4.7588 3.0522 4.6842 1.3670 3.9422 1.4441 5.4130 2.8019 1.2241 1.3841 7.0040 1.3997 1.9858 2.7115 1.5684 2.1281 1.5890 2.2501 2.0483 1.8766 1.6340 2.3466 2.1685 1.4247 1.3337 4.1804 2.1986 1.2665 1.2324 1.2249 1.7734 1.1470 1.0503 1.0467 1.0558 1.2499 1.0497 2.3762 4.3029 5.7064 8.9557 1.0371 1.0356 1.0359 1.0863 1.0974 1.0994 1.0994 1.0987 1.1004 1.1006 1.0923 1.0879 1.0978 1.0759
irintensity: 0.0601 1.7986 0.0654 2.7216 2.0796 0.5061 2.6558 1.2385 0.0081 2.2485 0.5772 1.1216 6.7529 1.6394 2.4825 4.5003 14.9782 3.3673 1.5760 0.4715 1.2168 42.9073 19.1322 59.1342 1.0594 1.0634 56.0474 6.4973 11.1560 20.9721 16.7515 2.8006 0.6966 84.5265 0.6501 124.5234 185.8844 15.2988 403.0885 1.6408 196.5327 16.1110 13.8888 15.7867 11.1581 1.0608 13.3552 17.9425 48.2929 2.7760 34.7859 26.4429 20.0630 105.8354 20.6089 5.2910 15.1266 9.1535 115.4412 15.4304 602.2638 36.3543 287.1495 235.1419 25.0983 16.5799 28.2774 7.2316 16.4882 5.2077 17.7037 63.3661 22.3130 30.7305 21.2441 7.7366 25.7643 31.8526
temp: 298.150 k
press: 1.00000 atm
elementType: 8 8 7 7 6 6 6 6 6 6 6 6 6 6 1 1 1 1 1 1 1 1 1 1 1 1 1 1
symmnumber: 1
zpe: 595390.7 jmol-1
zpe.correction: 0.226772 hartree
zpe.thermalcorrener: 0.241668 hartree
zpe.thermalcorrenthalpy: 0.242612 hartree
zpe.thermalcorrgfe: 0.181627 hartree
zpe.sumelectzpe: -648.376961 hartree
zpe.sumelectthermal: -648.362066 hartree
zpe.sumelectthermalent: -648.361122 hartree
zpe.sumelectthermalfe: -648.422106 hartree
dipole: -1.4011 -3.9556 0.6374
dipole: 4.2445
quadrupole: -58.1836 -84.1693 -85.1560
quadrupole: -0.1316 -0.3220 0.5211
quadrupole: 17.6527 -8.3330 -9.3197 -0.1316 -0.3220 0.5211
hfenergy: -648.6037338 hartree
pointgroup: C01 [X(C10H14N2O2)]
dipole: 0.5311636 -1.5809646 -0.0840527 debye
polarizability: 205.7831742|-0.8799599|127.4272642|3.6959937|-1.1682255|75.7393263 unknown
InChI: InChI=1S/C10H14N2O2/c1-7(2)14-10(13)12-9-6-8(3)4-5-11-9/h4-7,12H,1-3H3
charge 0 multiplicity 1
28 atoms
O  -2.48363 -0.630333 -0.091883
O  -1.560373 1.541242 0.027986
N  -0.247071 -0.460258 -0.063383
N  1.389139 1.283683 -0.023078
C  -3.866189 -0.043751 -0.110534
C  -4.212506 0.385734 -1.543707
C  -4.777377 -1.139593 0.448179
C  1.102823 -0.044399 -0.035539
C  3.466027 -0.691189 -0.005351
C  2.105401 -1.059457 -0.027163
C  -1.417252 0.30545 -0.038053
C  3.768704 0.699597 0.009678
C  4.568824 -1.731259 0.000916
C  2.709951 1.62843 0.000626
H  -3.850301 0.841795 0.552427
H  -5.236151 0.802329 -1.576353
H  -3.514136 1.163399 -1.895776
H  -4.166467 -0.478957 -2.229728
H  -5.819728 -0.775363 0.492022
H  -4.464796 -1.42911 1.466028
H  -4.749559 -2.036688 -0.195586
H  1.821679 -2.119133 -0.03601
H  -0.418027 -1.467213 -0.103101
H  4.806856 1.047376 0.028122
H  4.163824 -2.757287 0.016614
H  5.210247 -1.632149 -0.894582
H  5.223385 -1.608969 0.883615
H  2.9088 2.706273 0.011817
