program: Gaussian 09
title: 000239159
version: EM64L-G09RevD.01
frameworkgroup: C1[X(C10H14N2O)]
method: RPBEPBE
basis: SDD
operation: Freq
keyword: #p
keyword: freq=noraman
keyword: PBEPBE/SDD
title: #p freq=noraman PBEPBE/SDD
converged: YES YES NO NO
title: Mulliken charges:
elementType: O N N C C C C C C C C C C H H H H H H H H H H H H H H
charge: -0.445136 -0.151705 -0.125759 0.411087 0.358923 -0.373536 -0.354187 -0.389852 -0.385969 -0.646388 -0.645458 0.105698 -0.807237 0.233590 0.234664 0.231465 0.263565 0.234330 0.216466 0.233672 0.215673 0.234675 0.235398 0.283410 0.234084 0.234326 0.364204
chargesum: 0.00000
title: Mulliken charges with hydrogens summed into heavy atoms:
elementType: O N N C C C C C C C C C C
charge: -0.080932 -0.151705 -0.125759 0.411087 0.358923 -0.139946 -0.119523 -0.158387 -0.122404 0.038079 0.040287 0.105698 -0.055417
polarizability: 2.41081368e+02 9.76287330e+00 1.27860126e+02 5.31571385e-02 1.16143546e-01 6.57252028e+01
1716.lowfreq: -9.2187 -4.9706 -0.0007 0.0009 0.0009 8.7463 37.4119 61.0573 77.7174
frequency: 37.1802 61.0477 77.6281 104.9933 128.7968 146.9634 169.0152 200.1329 239.7106 252.6678 276.0135 337.3877 345.0841 415.9400 416.6887 420.9533 443.8281 487.6186 499.6439 561.2959 570.1172 634.2596 700.5244 737.8919 773.1661 804.4405 825.7343 864.7877 940.2358 943.4380 974.4425 977.8041 994.1102 1035.6716 1057.2892 1084.5187 1109.4061 1110.8644 1136.1201 1167.1520 1206.6374 1245.9820 1262.0526 1317.6957 1346.1386 1366.0975 1373.6283 1384.9218 1428.3310 1444.1734 1461.5894 1463.7198 1464.2870 1475.2478 1481.6564 1492.8267 1506.5121 1529.8933 1546.8242 1578.8270 1634.0971 2937.9346 2946.2381 2989.9770 3002.5513 3006.4064 3066.5624 3094.7797 3104.7443 3130.9084 3137.5065 3146.2554 3164.5995 3169.5184 3576.5962
redmass: 3.3164 4.0109 2.3208 1.7340 4.5189 1.1512 1.9602 1.1162 3.7290 3.1867 4.0852 3.2434 3.7931 3.8771 1.8213 1.8622 3.3195 3.5489 2.7179 2.3688 4.2723 7.1501 3.9657 3.5597 4.9707 1.2996 1.7185 8.1160 1.3604 3.1505 2.0974 1.3441 3.0473 1.5813 1.4898 2.4831 1.2433 1.3144 1.4473 1.6710 1.1422 1.4048 2.9129 1.4098 2.3117 4.2248 3.6109 1.3242 1.4396 2.2368 1.2302 1.1089 1.0398 1.0458 1.0485 1.0922 1.1234 2.8528 4.6707 6.2142 6.1842 1.0370 1.0395 1.0387 1.0997 1.1023 1.0974 1.0960 1.0939 1.0964 1.0875 1.0868 1.0942 1.0959 1.0673
irintensity: 0.1233 3.3578 0.0366 3.1090 1.3957 0.0195 0.0905 0.0043 1.5942 0.4346 0.1980 38.7618 0.3904 10.9422 57.8861 52.3089 2.7568 6.0804 0.1791 30.7369 28.8478 0.1295 16.9911 0.3399 0.7768 10.4516 75.6896 174.9074 0.3571 13.9908 67.5214 1.3016 0.0475 0.7684 25.7799 1.5944 0.1168 1.0840 4.6376 7.3193 87.3121 127.2822 31.4829 3.8360 2.2298 127.1510 62.1635 47.0625 10.3185 9.0564 8.7123 15.6264 0.0011 20.8664 20.3442 1.4108 44.1104 150.9759 63.4959 24.2575 265.0920 111.4284 111.5733 13.5237 16.4707 76.6479 17.0255 4.6718 46.9627 12.4898 9.3232 6.1942 27.7726 7.3275 70.8404
temp: 298.150 k
press: 1.00000 atm
elementType: 8 7 7 6 6 6 6 6 6 6 6 6 6 1 1 1 1 1 1 1 1 1 1 1 1 1 1
symmnumber: 1
zpe: 583480.3 jmol-1
zpe.correction: 0.222236 hartree
zpe.thermalcorrener: 0.236078 hartree
zpe.thermalcorrenthalpy: 0.237022 hartree
zpe.thermalcorrgfe: 0.181490 hartree
zpe.sumelectzpe: -573.155238 hartree
zpe.sumelectthermal: -573.141396 hartree
zpe.sumelectthermalent: -573.140452 hartree
zpe.sumelectthermalfe: -573.195983 hartree
dipole: 3.8800 0.3508 -0.0015
dipole: 3.8959
quadrupole: -61.8726 -68.3731 -82.5834
quadrupole: 1.3594 -0.0206 0.0000
quadrupole: 9.0704 2.5699 -11.6404 1.3594 -0.0206 0.0000
hfenergy: -573.3774738 hartree
pointgroup: C01 [X(C10H14N2O1)]
dipole: 1.5242697 0.1449922 0.0699973 debye
polarizability: 240.6481791|10.0977136|127.6619605|7.712059|4.6747144|66.3565577 unknown
InChI: InChI=1S/C10H14N2O/c1-8(11-13)9-4-6-10(7-5-9)12(2)3/h4-7,13H,1-3H3
charge 0 multiplicity 1
27 atoms
O  -4.627216 -0.815977 -0.325755
N  3.233215 -0.081759 0.041173
N  -3.164032 -0.99734 -0.279201
C  1.837147 -0.020233 -0.009726
C  -1.050973 0.099709 -0.117468
C  1.142213 1.228474 0.049041
C  1.042973 -1.209946 -0.123468
C  -0.262326 1.276906 -0.004098
C  -0.355073 -1.144049 -0.175224
C  4.018827 1.153574 0.14411
C  3.916502 -1.380063 -0.01172
C  -2.533003 0.165429 -0.172667
C  -3.234285 1.508112 -0.10708
H  1.69786 2.16617 0.137885
H  1.525113 -2.190509 -0.172797
H  -0.747846 2.257499 0.045293
H  -0.939984 -2.064995 -0.262535
H  3.832821 1.8318 -0.71379
H  5.092169 0.906673 0.152981
H  3.790506 1.712706 1.074909
H  5.004861 -1.223824 0.053707
H  3.706661 -1.920384 -0.957717
H  3.616681 -2.038112 0.829177
H  -4.324491 1.377484 -0.156069
H  -2.98104 2.033251 0.832313
H  -2.916127 2.153643 -0.946407
H  -4.936752 -1.75404 -0.402768
