program: Gaussian 09
title: 000021177
version: EM64L-G09RevD.01
frameworkgroup: C1[X(C12H16N2)]
method: RPBEPBE
basis: SDD
operation: Freq
keyword: #pfreq=noraman
keyword: PBEPBE/SDD
title: #p freq=noraman PBEPBE/SDD
converged: YES YES NO NO
title: Mulliken charges:
elementType: N N C C C C C C C C C C C C H H H H H H H H H H H H H H H H
charge: -0.125191 -0.017298 -0.165239 -0.325841 -0.320685 0.374989 -0.683191 -0.695912 -0.370784 -0.394615 -0.223908 -0.231291 -0.230044 -0.239200 0.258854 0.209919 0.235098 0.212473 0.209679 0.230109 0.207849 0.216705 0.227169 0.214442 0.223983 0.259270 0.254642 0.228022 0.229513 0.230482
chargesum: 0.00000
title: Mulliken charges with hydrogens summed into heavy atoms:
elementType: N N C C C C C C C C C C C C
charge: -0.125191 -0.017298 0.093615 0.119176 0.101466 0.374989 -0.028528 -0.030317 -0.111514 -0.139973 -0.223908 -0.003269 -0.000531 -0.008717
polarizability: 1.63832198e+02 -5.45356305e+00 1.40303286e+02 -5.33969821e+00 -1.50036332e+01 1.03064319e+02
1716.lowfreq: -11.5149 -8.9205 -4.7050 -0.0005 -0.0005 -0.0004 23.8254 38.9886 49.2172
frequency: 23.3784 38.9348 49.1579 80.4265 99.1532 115.0956 118.8665 200.2755 206.4135 222.2223 247.8746 288.0415 309.3882 360.7651 401.3564 404.8970 431.4395 459.9988 481.9507 613.0051 615.5470 649.1218 701.7931 724.7429 767.9400 800.4864 802.9632 836.2503 859.3504 909.7734 924.3355 943.5312 982.1352 984.0592 990.4510 999.3082 1027.5993 1060.5952 1074.4597 1084.3741 1087.5422 1115.5463 1153.5332 1172.0369 1185.3008 1193.8651 1199.1081 1253.6372 1276.8784 1293.7695 1319.9547 1327.7659 1367.5956 1374.0473 1383.1785 1389.5572 1390.2780 1436.4029 1468.1082 1469.3019 1473.7143 1480.3188 1481.6717 1485.9199 1492.4539 1594.2341 1612.9368 2160.6368 2887.7062 2903.7147 2985.4091 2985.5987 2994.0518 3041.9728 3047.4016 3077.7475 3080.3057 3091.3185 3092.4375 3124.5436 3130.6677 3141.7284 3151.5455 3165.4087
redmass: 3.9072 3.0559 2.6655 2.0796 4.0010 5.5212 2.4329 1.5650 1.6721 2.4545 2.3484 2.5456 3.7188 3.5392 4.4601 2.8696 4.4882 3.1664 3.5430 4.8863 6.4041 5.3541 2.4226 1.8130 1.9522 1.1839 1.2640 3.3067 1.2484 5.1670 1.5536 1.8684 1.6749 1.7780 6.0611 1.3236 2.1479 2.8904 1.9125 1.7613 1.8920 2.1002 2.0237 1.0602 1.1728 2.1920 1.9294 1.6453 1.1437 1.1772 1.3009 1.3239 1.3150 1.3878 6.7576 1.2289 1.2294 2.2104 1.0481 1.0572 1.0553 1.4740 1.3794 1.0701 1.0741 6.3104 6.0207 12.5639 1.0722 1.0705 1.0362 1.0359 1.0803 1.0901 1.0885 1.0982 1.0972 1.1005 1.1006 1.0848 1.0880 1.0921 1.0961 1.1015
irintensity: 0.6318 0.5631 0.1294 0.4708 0.4973 3.5956 2.3852 1.1149 1.2722 0.0939 0.7092 2.1081 1.2357 5.8160 3.5919 0.3087 2.8047 1.9546 4.7969 11.2849 0.1412 2.6021 23.4890 60.8238 29.3203 6.2066 7.6181 9.0808 0.2612 22.1931 2.1452 6.2598 4.4493 4.2012 0.5046 0.6209 9.6396 28.9256 22.9009 2.1502 3.7290 25.8262 17.6177 0.6160 6.3613 10.3461 16.4459 14.2078 2.6225 12.6005 2.6268 5.8954 4.0644 4.7597 0.0390 22.3904 23.8228 13.8582 7.4686 8.9760 2.7709 12.8028 15.7502 10.2560 14.4889 0.4631 5.3814 5.3985 51.3601 73.0614 25.8694 26.3318 5.1195 4.2446 6.2157 29.1616 79.2804 22.3681 45.8731 0.8697 1.8324 12.5609 26.5685 23.5575
temp: 298.150 k
press: 1.00000 atm
elementType: 7 7 6 6 6 6 6 6 6 6 6 6 6 6 1 1 1 1 1 1 1 1 1 1 1 1 1 1 1 1
symmnumber: 1
zpe: 660531.9 jmol-1
zpe.correction: 0.251583 hartree
zpe.thermalcorrener: 0.266359 hartree
zpe.thermalcorrenthalpy: 0.267304 hartree
zpe.thermalcorrgfe: 0.208265 hartree
zpe.sumelectzpe: -575.297056 hartree
zpe.sumelectthermal: -575.282279 hartree
zpe.sumelectthermalent: -575.281335 hartree
zpe.sumelectthermalfe: -575.340374 hartree
dipole: 0.2415 -3.1891 1.0881
dipole: 3.3783
quadrupole: -74.9275 -94.5483 -84.7932
quadrupole: 4.2639 -3.1954 2.7898
quadrupole: 9.8289 -9.7919 -0.0369 4.2639 -3.1954 2.7898
hfenergy: -575.5486389 hartree
pointgroup: C01 [X(C12H16N2)]
dipole: -0.1715888 1.1833656 0.5802952 debye
polarizability: 163.5329428|-6.307978|135.3506291|7.3233542|19.1430685|108.3162308 unknown
InChI: InChI=1S/C12H16N2/c1-3-14(4-2)12(10-13)11-8-6-5-7-9-11/h5-9,12H,3-4H2,1-2H3
charge 0 multiplicity 1
30 atoms
N  1.514245 0.457584 0.064892
N  1.372354 -2.787353 -1.180252
C  0.588914 -0.681331 0.302974
C  1.500669 0.950947 -1.345435
C  2.890597 0.229023 0.592254
C  -0.887719 -0.285346 0.128039
C  1.90447 2.432741 -1.454361
C  2.949825 0.107173 2.12624
C  -1.341415 0.895503 0.767996
C  -1.805808 -1.077551 -0.59962
C  0.961063 -1.88507 -0.514197
C  -2.697176 1.276538 0.681285
C  -3.164972 -0.695109 -0.68577
C  -3.6153 0.48057 -0.045201
H  0.723677 -0.981058 1.361119
H  2.157702 0.324689 -1.994655
H  0.47019 0.836834 -1.726661
H  3.36329 -0.666194 0.118795
H  3.493217 1.102158 0.287399
H  1.229769 3.058826 -0.845109
H  2.94085 2.613564 -1.116526
H  1.836946 2.764633 -2.506698
H  2.447095 0.968455 2.600468
H  2.481553 -0.821371 2.500709
H  4.00345 0.091383 2.459135
H  -0.616767 1.513055 1.309746
H  -1.463193 -1.990456 -1.100565
H  -3.038792 2.191387 1.178496
H  -3.867773 -1.314475 -1.253965
H  -4.668361 0.775848 -0.112332
