program: Gaussian 09
title: 000239150
version: EM64L-G09RevD.01
frameworkgroup: C1[X(C14H7N3O2)]
method: RPBEPBE
basis: SDD
operation: Freq
keyword: #p
keyword: freq=noraman
keyword: PBEPBE/SDD
title: #p freq=noraman PBEPBE/SDD
converged: YES YES NO NO
title: Mulliken charges:
elementType: O O N N N C C C C C C C C C C C C C C H H H H H H H
charge: -0.161792 -0.161802 -0.466146 0.025276 0.025148 0.237725 0.237740 0.213359 0.213358 -0.525380 -0.525378 -0.333684 -0.333685 0.346706 0.346645 -0.388855 -0.388830 -0.086563 -0.086397 0.309942 0.252987 0.252991 0.242198 0.242196 0.256122 0.256120
chargesum: 0.00000
title: Mulliken charges with hydrogens summed into heavy atoms:
elementType: O O N N N C C C C C C C C C C C C C C
charge: -0.161792 -0.161802 -0.156205 0.025276 0.025148 0.237725 0.237740 0.213359 0.213358 -0.272393 -0.272387 -0.091486 -0.091489 0.346706 0.346645 -0.132733 -0.132710 -0.086563 -0.086397
polarizability: 3.11309008e+02 -1.21723682e-02 2.35694042e+02 -7.08249840e-03 4.99147006e-02 6.48696756e+01
1716.lowfreq: -0.0001 0.0003 0.0006 3.7245 4.4405 6.0420 38.3646 43.9946 55.8928
frequency: 38.3645 43.9902 55.8915 68.2925 103.8598 138.5851 162.3078 225.4161 251.1276 323.6211 344.2162 363.0170 379.2774 413.4664 417.2290 422.6870 445.4466 475.4261 475.5814 501.5575 516.7971 526.0210 535.5304 544.9212 590.0492 632.8881 639.0055 696.6874 716.6756 739.4656 763.8455 816.6852 817.7228 820.2594 842.7603 889.0427 896.1203 905.6031 948.9518 948.9592 1016.0022 1072.5733 1092.9343 1130.1636 1131.5431 1211.6785 1227.2321 1250.3424 1273.4093 1288.8072 1315.4686 1381.3794 1404.0399 1412.0035 1437.0336 1450.4403 1482.4911 1506.6510 1512.3535 1589.8732 1591.8508 1621.5831 1644.9816 2322.9670 2330.9439 3145.7183 3146.2063 3150.5069 3152.2338 3173.9730 3174.1144 3610.9253
redmass: 14.6926 8.8699 11.3595 6.0083 6.9514 6.3036 8.4748 6.8978 5.2496 9.7408 9.1303 6.3479 9.0962 6.6751 6.3834 2.9964 2.8499 12.4033 12.0491 1.1616 8.1490 10.5593 4.4651 8.2047 3.1346 3.8379 6.9175 6.8576 8.0424 4.4195 3.5611 5.5712 1.4903 1.4705 4.8247 1.4546 1.6968 5.7552 1.3503 1.3471 2.6074 2.5726 4.1096 1.4921 1.3387 2.7246 1.3120 2.2737 1.4237 3.3120 2.0809 6.4660 4.0298 2.5327 6.3489 4.0193 4.9013 9.4053 6.3510 7.1258 5.9541 7.3667 7.9616 12.7160 12.7167 1.0894 1.0897 1.0929 1.0930 1.0966 1.0966 1.0804
irintensity: 0.0127 0.0000 1.3052 0.3479 1.2472 0.0000 1.7126 0.2127 0.0000 0.6890 6.9544 0.0000 0.6229 2.5569 16.4867 5.6333 0.0000 24.0638 0.1031 97.7326 29.8665 4.5850 0.8024 2.3361 32.1378 0.0004 0.4815 1.6547 57.3779 0.0005 0.0000 0.4482 0.0001 109.2537 0.1359 53.4871 0.0001 7.9707 0.2544 0.0262 5.0981 32.5023 70.3934 39.4417 1.3374 0.1429 11.1273 48.3953 7.9999 0.0937 115.5493 6.3815 44.3793 42.4374 56.0690 24.3781 15.0330 0.2292 124.8603 37.9482 26.3340 6.7046 0.0217 1128.9930 1817.8757 0.0003 18.4488 0.8038 6.3785 11.7305 3.3881 73.3555
temp: 298.150 k
press: 1.00000 atm
elementType: 8 8 7 7 7 6 6 6 6 6 6 6 6 6 6 6 6 6 6 1 1 1 1 1 1 1
symmnumber: 1
zpe: 470669.4 jmol-1
zpe.correction: 0.179269 hartree
zpe.thermalcorrener: 0.194217 hartree
zpe.thermalcorrenthalpy: 0.195161 hartree
zpe.thermalcorrgfe: 0.135609 hartree
zpe.sumelectzpe: -851.161441 hartree
zpe.sumelectthermal: -851.146492 hartree
zpe.sumelectthermalent: -851.145548 hartree
zpe.sumelectthermalfe: -851.205100 hartree
dipole: 0.0026 -7.2533 -0.0075
dipole: 7.2533
quadrupole: -128.7795 -103.6978 -111.0500
quadrupole: 0.0043 -0.0068 0.0556
quadrupole: -14.2704 10.8113 3.4591 0.0043 -0.0068 0.0556
hfenergy: -851.3407092 hartree
pointgroup: C01 [X(C14H7N3O2)]
dipole: -0.0005109 2.8305014 -0.3628259 debye
dipolederiv: -0.8148713 -0.6420489 0.0835326 -1.1360217 -1.5011604 0.1627678 0.1479806 0.1630065 -0.2715107 -0.8146977 0.64061 -0.0833733 1.1378131 -1.5008777 0.1626842 -0.1456104 0.1603027 -0.2711626 -1.3094079 -0.0002884 0.0004731 -0.0003095 -0.5908322 0.037164 0.000559 0.0376139 -0.3138211 -0.8237319 -0.4613663 0.060229 -1.1803056 -1.5957483 0.1824774 0.1535647 0.1819527 -0.2168699 -0.825512 0.4622749 -0.0597922 1.1807341 -1.595082 0.1812653 -0.1528174 0.1820065 -0.2167931 0.2148157 0.1339785 -0.0170421 -0.4074939 -0.1559039 0.0190636 0.0522918 0.0182368 -0.0130656 0.2144964 -0.1336331 0.0167123 0.4078175 -0.1556425 0.0187001 -0.0525957 0.0183454 -0.0130483 0.5074633 0.3701878 -0.0478468 0.9344921 0.2363446 -0.0228801 -0.1195933 -0.0223864 0.0661965 0.5088451 -0.3699676 0.0474303 -0.9342585 0.2351872 -0.0218664 0.1191464 -0.0219032 0.0660283 0.0111008 -0.1500412 0.0188734 0.1009275 -0.0316064 -0.0160916 -0.0129778 -0.0156527 -0.1541743 0.0110686 0.1500836 -0.0189794 -0.100853 -0.0316397 -0.0159673 0.0127577 -0.015814 -0.1541741 -0.0279562 -0.2213871 0.0279942 -0.0410423 0.0634739 -0.0311504 0.0048229 -0.0307998 -0.1760226 -0.0282775 0.2212952 -0.0281883 0.0409386 0.063733 -0.0312114 -0.0049855 -0.0310364 -0.1759998 0.5751452 0.485181 -0.0632084 0.8900381 0.7577859 -0.08716 -0.1158156 -0.0870333 0.1014421 0.5766616 -0.485491 0.0627212 -0.8903144 0.7568864 -0.085977 0.1157499 -0.0867541 0.101253 -0.1001076 0.0296564 -0.0041765 -0.24867 -0.001579 -0.0219932 0.0318742 -0.0223836 -0.1742081 -0.1002846 -0.0298401 0.0040665 0.2484974 -0.0014104 -0.0222732 -0.0321583 -0.022209 -0.174181 0.9762626 0.878486 -0.1142542 1.6851279 2.4315721 -0.2786887 -0.2191867 -0.278612 0.3260112 0.9768465 -0.8777923 0.1142934 -1.6872285 2.4311358 -0.2783262 0.2164412 -0.2760579 0.325724 0.1113367 -0.0000514 0.0001238 -0.0000501 0.2423214 0.0126634 0.000118 0.0121278 0.3419383 0.0798104 0.0411086 -0.0051071 0.0075153 -0.0468548 0.0267552 -0.0007519 0.0269 0.1587899 0.0798722 -0.0409816 0.00517 -0.0073822 -0.0468837 0.0267556 0.0008117 0.0269669 0.158783 0.0686465 0.0180913 -0.0021345 0.0558393 -0.0914194 0.0340998 -0.0069135 0.0340514 0.1713151 0.0687234 -0.0179166 0.0022216 -0.0556633 -0.0914942 0.034161 0.0070286 0.0340713 0.1713055 -0.0681531 0.0366827 -0.0042724 0.02793 0.1098782 0.0075042 -0.0031465 0.0075165 0.1681251 -0.068095 -0.0368304 0.0045338 -0.0280778 0.1098163 0.007524 0.0034057 0.007544 0.1681191 unknown
polarizability: 311.3089238|0.0381516|232.9007949|-0.1165627|-21.6647338|67.6630074 unknown
InChI: InChI=1S/C14H7N3O2/c18-7-15-9-1-3-13-11(5-9)12-6-10(16-8-19)2-4-14(12)17-13/h1-6,17H
charge 0 multiplicity 1
26 atoms
O  -5.000322 -3.379512 0.462191
O  5.002455 -3.375849 0.457091
N  -0.001135 2.649703 -0.320681
N  -4.071016 -1.148412 0.172017
N  4.072731 -1.144773 0.167107
C  -0.729593 0.4789 -0.042961
C  0.729589 0.479548 -0.043862
C  -1.146993 1.845116 -0.216946
C  1.145564 1.846145 -0.218265
C  -1.698009 -0.538379 0.088649
C  1.699068 -0.53688 0.08649
C  -2.510454 2.202718 -0.26026
C  2.508654 2.204969 -0.263141
C  -3.069413 -0.181148 0.045697
C  3.070101 -0.178411 0.042024
C  -3.466721 1.179408 -0.127573
C  3.465991 1.182508 -0.131627
C  -4.474832 -2.286745 0.31983
C  4.477692 -2.28256 0.316086
H  -0.001661 3.659035 -0.448197
H  -1.410106 -1.58632 0.222613
H  1.412264 -1.585088 0.22072
H  -2.82869 3.241597 -0.392422
H  2.825806 3.244139 -0.395617
H  -4.535702 1.409866 -0.154941
H  4.534733 1.413925 -0.160224
