program: Gaussian 09
title: 000239211
version: EM64L-G09RevD.01
frameworkgroup: C1[X(C15H20N2O3)]
method: RPBEPBE
basis: SDD
operation: Freq
keyword: #p
keyword: freq=noraman
keyword: PBEPBE/SDD
title: #p freq=noraman PBEPBE/SDD
converged: YES YES NO NO
title: Mulliken charges:
elementType: O O O N N C C C C C C C C C C C C C C C H H H H H H H H H H H H H H H H H H H H
charge: -0.299422 -0.214575 -0.238722 -0.414857 -0.396366 0.205200 -0.455229 0.382708 -0.711775 0.145492 -0.755224 -0.733802 0.157388 -0.453010 0.450294 -0.430413 -0.345465 -0.222510 -0.232974 -0.238605 0.204137 0.259789 0.217755 0.248790 0.247506 0.337904 0.223809 0.222865 0.232768 0.221129 0.208911 0.239672 0.348243 0.186247 0.232299 0.228978 0.249791 0.228678 0.231454 0.231142
chargesum: 0.00000
title: Mulliken charges with hydrogens summed into heavy atoms:
elementType: O O O N N C C C C C C C C C C C C C C C
charge: -0.299422 -0.214575 -0.238722 -0.076954 -0.048123 0.205200 0.008697 0.382708 0.002277 0.145492 -0.075783 -0.064090 0.157388 -0.034464 0.450294 -0.201434 -0.095674 0.006168 -0.001519 -0.007463
polarizability: 2.00762201e+02 8.90480669e+00 1.73765664e+02 1.15764499e+01 3.91519320e+00 1.60652575e+02
1716.lowfreq: -16.2701 -9.9421 -0.0003 0.0005 0.0006 3.0296 10.4793 27.5935 39.9715
frequency: 7.6624 27.5383 39.2656 57.7844 59.9023 103.3799 118.6537 153.7315 157.6349 183.2554 202.1521 224.8308 230.7519 239.5298 265.6176 269.4318 294.6182 316.7494 327.0295 363.6825 376.4681 396.6755 402.9096 420.7809 462.1472 475.5428 485.3258 522.0679 586.8273 601.0124 603.4263 616.0640 637.8107 644.4075 678.8617 702.0857 707.5937 735.1494 753.3369 758.7604 797.3974 810.2969 856.9048 871.3208 907.9102 913.0488 915.8581 948.8089 956.8567 962.9369 978.9592 983.1062 987.8436 991.3554 991.6906 1000.5924 1027.0422 1073.4639 1085.9717 1102.5912 1167.1480 1170.3314 1171.6334 1182.8509 1187.0196 1203.2052 1225.3380 1236.0821 1255.4613 1295.1669 1306.8740 1312.5584 1319.5270 1345.1406 1347.0687 1365.2864 1370.2686 1379.4142 1395.2228 1396.2845 1435.3807 1438.6539 1456.0443 1461.5166 1465.6330 1466.6336 1471.4901 1480.3862 1483.6155 1490.2876 1592.2642 1612.6288 1677.4613 1714.0166 2931.9409 2980.4788 2985.6716 2996.4809 3000.3235 3041.1909 3060.3393 3077.0305 3081.5758 3086.8469 3094.6960 3107.6056 3110.1149 3124.7629 3126.9838 3147.3560 3156.6062 3182.4813 3588.2319 3619.0246
redmass: 4.4086 6.1645 4.5764 4.7814 4.2287 3.8304 4.6308 3.6233 8.6020 3.1272 2.0636 1.4934 1.6451 1.8182 3.0691 2.2196 1.2409 2.1817 2.4573 2.7219 5.5415 2.1419 2.8250 3.9254 3.4698 2.4534 1.3533 3.3061 4.3121 4.1936 8.7828 6.4052 3.5996 1.2997 3.7812 4.8926 2.1109 4.3389 2.4409 3.2688 3.3494 3.1117 1.2465 2.0783 1.5498 1.8863 1.5192 2.0866 3.8252 2.4867 1.3930 1.9162 1.8232 3.8659 1.6002 1.5274 2.1722 1.8392 1.5462 2.2965 2.8765 2.3387 1.2428 2.3041 1.1856 2.3522 2.9301 1.8466 2.2362 1.8666 1.8034 2.2322 1.2904 1.3333 1.6481 1.4666 1.4683 2.9424 1.2531 1.3084 1.0875 2.0975 1.0975 1.0610 1.0594 1.0585 1.0630 1.5215 1.3005 1.0835 5.9903 6.0817 7.9415 9.3442 1.0541 1.0555 1.0404 1.0582 1.0377 1.1036 1.1001 1.0990 1.0991 1.0990 1.0997 1.0955 1.0917 1.0857 1.0943 1.0959 1.0979 1.0917 1.0801 1.0799
irintensity: 0.1444 0.1314 0.1379 0.3236 0.6188 0.5982 2.3188 3.2152 4.5963 0.8226 0.6580 0.2052 0.1527 0.2382 6.4347 1.9706 0.7116 2.3756 0.5536 1.1760 14.2085 3.8798 0.5982 7.9976 7.6628 15.2087 64.9149 3.0343 11.0279 7.6545 7.0821 0.1527 27.0851 143.3020 1.6112 10.1082 44.0740 50.4709 33.8529 44.7721 4.9889 3.5989 0.2679 6.0795 3.2562 7.7459 2.9838 16.6722 75.7750 43.8575 2.3577 6.8337 15.6441 5.8753 6.8613 15.3407 2.1187 11.6149 8.6891 11.8322 71.8971 6.3136 10.8108 4.5981 1.3929 19.1182 123.9196 46.1085 30.0131 26.8996 84.6291 107.2966 2.1079 3.5024 40.5009 17.9405 17.7167 14.1066 20.0536 1.3060 7.9824 6.9774 2.8457 4.0195 3.5736 10.5581 6.5264 12.3576 9.7701 39.8425 1.8099 2.6960 535.8179 362.3018 15.2166 29.2373 36.1364 10.5482 18.9065 13.2742 4.2715 12.5124 68.5289 35.8938 18.0046 12.6376 13.0156 0.4635 22.3429 44.3716 10.5570 22.0764 76.0349 36.7509
temp: 298.150 k
press: 1.00000 atm
elementType: 8 8 8 7 7 6 6 6 6 6 6 6 6 6 6 6 6 6 6 6 1 1 1 1 1 1 1 1 1 1 1 1 1 1 1 1 1 1 1 1
symmnumber: 1
zpe: 859828.2 jmol-1
zpe.correction: 0.327491 hartree
zpe.thermalcorrener: 0.347437 hartree
zpe.thermalcorrenthalpy: 0.348381 hartree
zpe.thermalcorrgfe: 0.277169 hartree
zpe.sumelectzpe: -917.296290 hartree
zpe.sumelectthermal: -917.276344 hartree
zpe.sumelectthermalent: -917.275400 hartree
zpe.sumelectthermalfe: -917.346612 hartree
dipole: -4.3849 1.1606 -1.2928
dipole: 4.7165
quadrupole: -126.2481 -117.7423 -127.3279
quadrupole: 5.8650 6.1122 -12.6141
quadrupole: -2.4754 6.0305 -3.5551 5.8650 6.1122 -12.6141
hfenergy: -917.6237812 hartree
pointgroup: C01 [X(C15H20N2O3)]
dipole: -1.5876723 -0.655632 0.7020091 debye
polarizability: 195.3052473|-3.4277184|170.9432187|-19.532465|6.1735665|168.9319747 unknown
InChI: InChI=1S/C15H20N2O3/c1-14(2,20-9-11-7-5-4-6-8-11)10-15(3)12(18)16-13(19)17-15/h4-8,16-17H,9-10H2,1-3H3
charge 0 multiplicity 1
40 atoms
O  -0.877759 -1.394622 -0.912609
O  3.292403 -0.072629 -2.796817
O  4.372506 1.772263 1.408071
N  2.375955 0.795837 0.543354
N  4.151317 0.908714 -0.814803
C  1.878808 0.224486 -0.734418
C  1.502462 -1.285456 -0.633774
C  0.194018 -1.725895 0.082319
C  0.785686 1.112987 -1.378177
C  3.170507 0.315654 -1.611253
C  -0.049471 -1.028942 1.441089
C  0.266542 -3.262358 0.27483
C  3.692515 1.225335 0.506961
C  -2.282903 -1.688046 -0.554584
C  -3.011799 -0.520628 0.098828
C  -3.707335 -0.688349 1.321148
C  -3.038576 0.749081 -0.534709
C  -4.413968 0.388618 1.905566
C  -3.737704 1.828495 0.047736
C  -4.427951 1.651635 1.271269
H  2.347396 -1.801089 -0.13724
H  1.446776 -1.669547 -1.669683
H  1.149757 2.151083 -1.479691
H  0.533353 0.718774 -2.376123
H  -0.133032 1.107094 -0.772075
H  1.792762 0.961524 1.360002
H  0.835441 -1.146301 2.093559
H  -0.272079 0.044782 1.313691
H  -0.910887 -1.47584 1.966397
H  1.070303 -3.526028 0.985974
H  -0.677118 -3.668497 0.680878
H  0.472454 -3.760127 -0.68881
H  5.103745 1.111175 -1.118859
H  -2.362058 -2.59326 0.079202
H  -2.747083 -1.921276 -1.531102
H  -3.700695 -1.667074 1.81861
H  -2.509816 0.882413 -1.48572
H  -4.949031 0.243266 2.850805
H  -3.751372 2.803519 -0.452399
H  -4.973371 2.488328 1.721954
