program: Gaussian 09
title: 000239173
version: EM64L-G09RevD.01
frameworkgroup: C1[X(C18H14N4O2)]
method: RPBEPBE
basis: SDD
operation: Freq
keyword: #p
keyword: freq=noraman
keyword: PBEPBE/SDD
title: #p freq=noraman PBEPBE/SDD
converged: YES YES NO NO
title: Mulliken charges:
elementType: O O N N N N C C C C C C C C C C C C C C C C C C H H H H H H H H H H H H H H
charge: -0.225788 -0.224046 -0.028829 -0.374705 -0.059761 0.027851 -0.039713 0.313548 0.244538 -0.365867 -0.393525 -0.373902 -0.367906 -0.234552 -0.218901 -0.227875 -0.217995 0.172957 -0.238332 -0.231373 -0.278440 -0.251526 0.353846 -0.413520 0.252027 0.270198 0.260796 0.262520 0.230245 0.237940 0.230781 0.236148 0.338972 0.233361 0.238245 0.280847 0.290572 0.291163
chargesum: 0.00000
title: Mulliken charges with hydrogens summed into heavy atoms:
elementType: O O N N N N C C C C C C C C C C C C C C C C C C
charge: -0.225788 -0.224046 -0.028829 -0.035733 -0.059761 0.027851 -0.039713 0.313548 0.244538 -0.113840 -0.123327 -0.113106 -0.105385 -0.004307 0.019039 0.002906 0.018154 0.172957 -0.004971 0.006872 0.002407 0.039047 0.353846 -0.122358
polarizability: 5.03579421e+02 -1.00087663e+01 2.76744519e+02 5.05164762e+00 -4.33725700e+00 1.19605539e+02
1716.lowfreq: -4.8345 -0.4765 0.0003 0.0005 0.0006 3.4031 25.2542 31.7986 36.3934
frequency: 25.2108 31.7960 36.3884 44.7909 60.0079 67.4478 76.6697 85.3008 128.4992 165.8351 193.0676 211.8501 228.2745 275.3240 278.4558 293.6128 338.9647 391.8333 399.8083 405.9323 424.0080 434.3357 471.3157 489.4534 494.9271 515.7897 598.5093 609.0415 611.4855 615.5940 638.6583 651.0133 670.9528 672.7845 694.9126 699.2772 714.0922 735.7087 763.1447 770.3100 780.9737 785.9051 850.5077 855.1736 857.1936 866.3966 931.1577 937.6433 952.3323 958.3473 978.4677 985.7986 987.9823 988.5402 989.3744 1001.6455 1001.9569 1005.0708 1023.8982 1030.1477 1073.8028 1082.1997 1090.6806 1104.9632 1126.9079 1172.9936 1176.4714 1178.1520 1191.4555 1193.1073 1220.8281 1253.9673 1291.8537 1307.7812 1319.1578 1325.7852 1345.9574 1370.2103 1372.3044 1382.4395 1405.2114 1426.8430 1433.6819 1438.7793 1475.3167 1482.6269 1504.0389 1530.0000 1558.0599 1580.1191 1583.9637 1590.9493 1606.4821 1610.0830 3127.9480 3128.3618 3133.4726 3137.5506 3144.9485 3150.5820 3155.3209 3161.2315 3170.1425 3171.3852 3172.0768 3178.8857 3201.1964 3392.0313
redmass: 5.2171 6.5638 6.9444 5.1455 4.1215 4.9633 6.3978 6.1978 7.2160 6.6695 7.2189 4.8064 5.9042 5.5137 7.4785 5.4318 4.9742 6.9614 2.9147 2.9214 4.0066 5.8172 4.4453 4.0866 3.0320 6.1952 6.1649 5.9838 7.9257 6.4945 6.4719 3.5337 7.0942 5.8478 1.6874 1.6919 1.8500 3.2469 5.2392 4.4996 2.2034 2.6209 3.5228 1.5893 1.3074 1.2448 1.6430 1.4152 1.4261 3.3462 3.6369 1.5516 3.9306 3.1682 1.7987 1.3213 1.3217 1.3160 2.4724 1.9948 2.9840 1.6287 1.9007 2.3505 1.6554 1.1346 1.0545 2.0429 1.2564 1.1723 7.9252 1.8015 1.8350 1.7875 1.3575 1.9052 7.1779 5.6543 5.7656 7.7526 3.9100 2.3591 2.3254 2.3349 2.2172 2.3940 4.2596 4.1721 6.7975 5.7942 6.1442 6.8144 5.9468 6.0866 1.0868 1.0850 1.0872 1.0883 1.0921 1.0930 1.0965 1.0960 1.1016 1.1001 1.0929 1.0903 1.0971 1.0751
irintensity: 0.0938 0.3313 0.4692 0.1660 0.1621 0.2692 0.5019 2.6954 2.1842 1.2495 3.1777 2.2341 1.2540 1.8434 1.9543 3.7893 5.3136 2.2720 1.1576 0.5988 2.3653 19.1715 0.5487 6.3431 12.4129 9.5777 1.3669 2.8200 1.7041 0.1263 12.7500 39.3665 9.9774 19.8466 75.7062 18.7462 22.4790 6.7289 13.7835 2.8744 52.8332 48.2936 9.1441 32.8130 2.6493 2.7103 6.4455 2.7145 11.8343 23.5255 15.1615 1.4634 2.6006 1.0214 3.1814 0.7929 0.1610 0.3035 18.6708 7.7876 83.9504 8.0939 1.8729 93.2512 64.6305 10.2949 0.0362 43.8144 14.0007 3.4474 1175.3671 23.7243 44.3921 18.3205 2.2281 39.7822 55.4851 2.5004 17.0925 1.2844 138.6745 30.1800 12.4413 23.0664 28.7086 34.4232 159.3330 120.2072 13.2044 3.8938 1.0109 873.0198 0.3333 16.6445 2.9438 1.9894 0.1719 4.2769 10.8132 22.8737 21.3743 26.9971 24.7305 21.0160 0.3272 0.9357 0.9330 74.6313
temp: 298.150 k
press: 1.00000 atm
elementType: 8 8 7 7 7 7 6 6 6 6 6 6 6 6 6 6 6 6 6 6 6 6 6 6 1 1 1 1 1 1 1 1 1 1 1 1 1 1
symmnumber: 1
zpe: 747757.0 jmol-1
zpe.correction: 0.284806 hartree
zpe.thermalcorrener: 0.304428 hartree
zpe.thermalcorrenthalpy: 0.305372 hartree
zpe.thermalcorrgfe: 0.233771 hartree
zpe.sumelectzpe: -1062.012143 hartree
zpe.sumelectthermal: -1061.992521 hartree
zpe.sumelectthermalent: -1061.991576 hartree
zpe.sumelectthermalfe: -1062.063177 hartree
dipole: 9.3701 1.0611 -0.0288
dipole: 9.4300
quadrupole: -178.7185 -121.6393 -137.1944
quadrupole: 2.2357 2.3406 -2.8497
quadrupole: -32.8677 24.2115 8.6563 2.2357 2.3406 -2.8497
hfenergy: -1062.2969484 hartree
pointgroup: C01 [X(C18H14N4O2)]
dipole: -3.687504 0.38885 -0.1248751 debye
polarizability: 502.3908166|11.2693466|276.5852824|20.4752343|8.835204|120.9533804 unknown
InChI: InChI=1S/C18H14N4O2/c23-22(24)16-11-12-17(19-13-16)20-21-18(14-7-3-1-4-8-14)15-9-5-2-6-10-15/h1-13,20H
charge 0 multiplicity 1
38 atoms
O  6.54931 -1.528064 0.37701
O  6.807092 0.735964 0.165055
N  -0.39608 -0.500946 0.011739
N  0.547797 0.502897 -0.01896
N  2.71283 1.312476 -0.030475
N  6.072576 -0.329274 0.243648
C  -1.687171 -0.173775 -0.029025
C  -2.653284 -1.300574 -0.087805
C  -2.18433 1.243767 -0.030746
C  -4.022154 -1.101534 0.247344
C  -1.851419 2.133954 1.028101
C  -2.226872 -2.605525 -0.470504
C  -2.989097 1.72055 -1.100631
C  -4.935505 -2.176755 0.206242
C  -2.311887 3.469311 1.013971
C  -3.140798 -3.675396 -0.509939
C  -3.439617 3.058444 -1.117763
C  1.899576 0.206101 0.051293
C  -4.501119 -3.467464 -0.172198
C  -3.102923 3.936642 -0.060924
C  2.390929 -1.126507 0.20282
C  3.775993 -1.310126 0.265601
C  4.619352 -0.171337 0.179288
C  4.050274 1.118182 0.033495
H  -4.367328 -0.10838 0.553517
H  -1.257742 1.772339 1.876042
H  -1.17675 -2.756228 -0.737742
H  -3.253548 1.041041 -1.918251
H  -5.984494 -2.007846 0.473273
H  -2.055413 4.140502 1.840602
H  -2.798667 -4.67188 -0.810671
H  -4.053168 3.414343 -1.952453
H  0.299248 1.499042 -0.12167
H  -5.211688 -4.300598 -0.207374
H  -3.455689 4.973567 -0.073756
H  1.686814 -1.957258 0.268921
H  4.223262 -2.300915 0.380421
H  4.692789 2.000561 -0.031898
