program: Gaussian 09
title: 000021267
version: EM64L-G09RevD.01
frameworkgroup: C1[X(C22H21NO2)]
method: RPBEPBE
basis: SDD
operation: Freq
keyword: #p
keyword: freq=noraman
keyword: PBEPBE/SDD
title: #p freq=noraman PBEPBE/SDD
converged: YES YES NO NO
title: Mulliken charges:
elementType: O O N C C C C C C C C C C C C C C C C C C C C C C H H H H H H H H H H H H H H H H H H H H H
charge: -0.464683 -0.262692 -0.003779 -0.276958 0.016186 -0.483223 0.169092 -0.584127 0.328065 0.487198 0.403147 -0.369406 -0.549782 -0.446784 -0.357262 -0.339276 -0.341080 -0.399180 0.321224 -0.228289 -0.258028 -0.354707 -0.344609 -0.246291 -0.535784 0.229171 0.228510 0.239140 0.225954 0.234733 0.264408 0.261794 0.351991 0.226942 0.252478 0.248092 0.276459 0.246664 0.223045 0.221081 0.236054 0.237185 0.225093 0.247274 0.221952 0.223010
chargesum: 0.00000
title: Mulliken charges with hydrogens summed into heavy atoms:
elementType: O O N C C C C C C C C C C C C C C C C C C C C C C
charge: -0.112692 -0.262692 -0.003779 -0.047787 0.016186 -0.015574 0.169092 -0.123440 0.328065 0.487198 0.403147 -0.104997 -0.287988 -0.219842 -0.104785 -0.091184 -0.064621 -0.152517 0.321224 -0.005244 -0.036948 -0.118653 -0.107424 -0.021198 0.156451
polarizability: 3.26243769e+02 -8.36213225e+00 2.19703949e+02 -1.29554205e+01 -4.69711052e+00 1.83017426e+02
1716.lowfreq: -4.0532 -0.0005 -0.0001 0.0004 8.0528 10.0867 28.8285 42.0789 44.2644
frequency: 28.8177 42.0777 44.2617 53.8499 68.0295 75.5767 90.7052 146.5546 150.6047 173.8794 193.8520 203.1702 217.1007 223.4206 234.2871 261.2023 264.5641 267.0963 282.4642 320.4152 368.6243 370.9842 374.2479 405.4474 416.8817 440.2664 488.9808 494.5183 526.4767 536.8428 565.9429 582.5512 598.9195 615.3353 630.8081 643.2414 661.8634 695.1055 705.7515 711.1187 743.0935 754.1911 775.0291 799.1006 813.6310 827.6486 852.4892 853.1096 875.1759 889.1496 896.5647 917.2904 919.0824 943.7394 949.4261 954.1413 961.0737 971.1004 975.1720 986.8898 990.8387 993.8147 1000.9633 1014.2908 1029.1189 1052.5824 1062.4892 1076.5105 1085.6627 1093.6453 1113.6597 1119.6700 1146.1423 1168.1220 1171.8362 1173.2694 1186.6487 1192.2437 1204.3604 1211.3381 1219.9494 1228.3702 1247.0208 1271.2893 1277.5881 1288.6874 1296.9098 1313.2259 1324.6176 1331.8352 1339.8146 1358.9687 1376.9522 1384.9240 1398.6513 1426.5729 1439.2288 1442.3116 1453.9286 1461.3121 1463.2044 1467.4491 1473.6436 1483.3221 1491.5711 1551.2600 1574.4547 1582.8899 1591.2018 1613.3419 1620.8283 2957.2401 2961.5821 2974.6337 3004.8574 3028.3333 3050.6279 3068.2387 3112.8279 3121.9942 3123.2087 3126.1246 3127.5421 3131.3153 3137.6334 3143.4970 3147.0532 3156.1247 3167.1248 3171.9986 3179.0911 3551.8865
redmass: 4.4620 4.7275 5.0661 3.8274 4.0630 4.6825 3.4443 4.1182 3.5564 3.5398 1.7249 2.2374 3.0578 2.2102 2.6218 4.2999 3.0256 3.1390 3.2937 4.1449 5.7406 4.0447 2.5374 2.8327 3.4897 3.5060 4.4103 4.5463 3.5171 4.4263 3.3382 4.1007 4.1123 5.7295 4.4222 4.2106 6.9959 4.9139 1.7203 4.5296 3.9645 3.6853 2.0294 2.5122 1.4320 1.5798 1.7074 1.9277 2.8377 1.7020 1.2654 1.5210 2.3672 3.2126 3.7548 1.4224 6.4613 1.4694 1.3984 1.4666 2.5650 1.8870 3.8902 2.6276 2.1870 2.2715 2.0936 1.9602 1.7078 1.8758 1.2643 2.3378 1.4613 1.2167 1.6105 1.1908 1.6442 1.1398 2.1648 1.5727 1.4153 1.7958 3.0970 1.7537 1.4996 1.5602 3.0891 1.6947 1.6300 1.3331 1.4144 1.5118 7.9291 5.0880 1.9453 2.7962 1.3275 2.0694 1.1426 1.9386 1.0926 1.0499 1.0776 2.2863 2.4676 7.6073 7.3260 5.7383 5.9653 6.1227 6.6915 1.0654 1.0329 1.0822 1.0628 1.0919 1.1041 1.1037 1.0869 1.0871 1.0869 1.0913 1.0969 1.0903 1.0930 1.0915 1.0971 1.0982 1.0936 1.0963 1.0945 1.0661
irintensity: 0.2626 0.2632 0.1254 0.2122 0.8104 2.4335 5.2434 3.2954 1.9582 2.6507 69.6918 42.4057 0.2966 0.6848 1.2456 3.6741 0.4857 4.8250 6.5308 1.7175 4.7541 0.3398 0.6942 0.0851 1.2523 1.9786 3.4834 11.0049 5.0517 7.2897 16.4188 27.7373 13.4160 1.4484 0.1257 10.7280 1.1884 11.8344 54.6778 14.9669 2.2380 2.8060 29.1023 16.1685 45.1928 44.4449 0.6155 0.1840 3.9990 53.9212 1.8674 3.6892 12.1722 0.3025 6.2414 0.0698 3.5935 0.3436 0.1137 1.2054 0.6045 0.6807 65.1365 22.3457 4.8541 4.3712 8.4619 13.2286 5.3115 4.2666 0.6124 40.6140 11.0380 3.0095 49.8270 7.9694 5.7711 0.8696 12.8750 7.3515 4.5624 16.4835 137.5593 125.8149 2.1959 6.1726 3.6810 14.8800 3.7873 4.9951 1.0974 9.1675 6.0350 0.2412 21.5965 24.1436 0.6583 10.8551 10.7842 5.7472 7.5464 14.0752 50.9755 16.7063 82.7757 5.9298 27.6500 46.5039 1.3937 15.5063 117.9282 26.1091 69.0840 12.2481 25.8631 36.2345 45.2972 21.4668 8.9214 12.6681 1.1878 26.5513 8.4702 25.2045 33.4054 5.0489 17.4175 39.2760 11.9642 7.6790 4.1951 7.0434
temp: 298.150 k
press: 1.00000 atm
elementType: 8 8 7 6 6 6 6 6 6 6 6 6 6 6 6 6 6 6 6 6 6 6 6 6 6 1 1 1 1 1 1 1 1 1 1 1 1 1 1 1 1 1 1 1 1 1
symmnumber: 1
zpe: 975904.0 jmol-1
zpe.correction: 0.371702 hartree
zpe.thermalcorrener: 0.393204 hartree
zpe.thermalcorrenthalpy: 0.394148 hartree
zpe.thermalcorrgfe: 0.321006 hartree
zpe.sumelectzpe: -1054.354559 hartree
zpe.sumelectthermal: -1054.333057 hartree
zpe.sumelectthermalent: -1054.332113 hartree
zpe.sumelectthermalfe: -1054.405256 hartree
dipole: 3.9136 -1.2784 0.6232
dipole: 4.1640
quadrupole: -129.4937 -158.6636 -138.4181
quadrupole: 13.4847 2.2996 2.7672
quadrupole: 12.6981 -16.4718 3.7737 13.4847 2.2996 2.7672
hfenergy: -1054.7262613 hartree
pointgroup: C01 [X(C22H21N1O2)]
dipole: -1.5315099 -0.5474263 -0.1965226 debye
polarizability: 325.6907853|9.4212781|220.4931711|-14.7552071|1.7635625|182.7811869 unknown
InChI: InChI=1S/C22H21NO2/c1-25-19-8-10-21-17(15-19)7-9-20(16-5-3-2-4-6-16)22(21,24)18-11-13-23-14-12-18/h2-6,8,10-15,20,24H,7,9H2,1H3
charge 0 multiplicity 1
46 atoms
O  0.329132 -0.642693 -1.780629
O  -5.655799 -0.71077 0.244482
N  1.647884 3.925745 0.095179
C  0.879269 -1.0934 0.563267
C  0.058566 -0.152672 -0.394558
C  0.264191 -2.513607 0.534676
C  -1.453708 -0.266271 -0.143034
C  -1.164241 -2.494617 1.111222
C  -2.032722 -1.399569 0.503129
C  2.381446 -1.092624 0.284224
C  0.578887 1.287447 -0.248651
C  -2.314601 0.73262 -0.664305
C  -3.436102 -1.493672 0.605511
C  3.267239 -0.467108 1.198384
C  2.932885 -1.733399 -0.856974
C  0.243498 2.077295 0.880351
C  1.465648 1.848179 -1.195821
C  -3.717851 0.640329 -0.565594
C  -4.281377 -0.489764 0.077805
C  4.66426 -0.475207 0.985436
C  4.32839 -1.744577 -1.072673
C  0.793959 3.3707 1.008788
C  1.965952 3.153753 -0.986841
C  5.201441 -1.116854 -0.153298
C  -6.574301 0.300284 -0.287218
H  0.73147 -0.681616 1.583343
H  0.899627 -3.200448 1.122966
H  0.25159 -2.879927 -0.507703
H  -1.106669 -2.331136 2.208451
H  -1.652878 -3.477457 0.972333
H  -1.878673 1.616763 -1.144464
H  -3.901373 -2.355409 1.09659
H  -0.479744 -0.458327 -2.323449
H  2.858383 0.036167 2.083861
H  2.263956 -2.200974 -1.585005
H  -0.448405 1.702683 1.642969
H  1.760328 1.264375 -2.071561
H  -4.344429 1.436056 -0.978144
H  5.328881 0.017818 1.70402
H  4.736038 -2.241149 -1.960985
H  0.546391 4.000885 1.871148
H  2.655171 3.608342 -1.707793
H  6.284257 -1.127352 -0.322472
H  -7.580625 -0.073686 -0.048958
H  -6.465172 0.406035 -1.38405
H  -6.416072 1.28251 0.198747
