program: Gaussian 09
title: 000239153
version: EM64L-G09RevD.01
frameworkgroup: C1[X(C18H23N3O)]
method: RPBEPBE
basis: SDD
operation: Freq
keyword: #p
keyword: freq=noraman
keyword: PBEPBE/SDD
title: #p freq=noraman PBEPBE/SDD
converged: YES YES NO NO
title: Mulliken charges:
elementType: O N N N C C C C C C C C C C C C C C C C C C H H H H H H H H H H H H H H H H H H H H H H H
charge: -0.271040 -0.151704 -0.152301 -0.062103 0.341411 0.341911 -0.047369 0.398944 0.400257 -0.396592 -0.366676 -0.419443 -0.399195 -0.368466 -0.377399 -0.357993 -0.371063 -0.646714 -0.647560 -0.646295 -0.646877 -0.488935 0.253109 0.257658 0.254705 0.255941 0.233267 0.232689 0.232669 0.233780 0.232487 0.234777 0.214035 0.232938 0.233015 0.214568 0.233865 0.235019 0.214442 0.232968 0.214940 0.234276 0.218835 0.220543 0.214679
chargesum: 0.00000
title: Mulliken charges with hydrogens summed into heavy atoms:
elementType: O N N N C C C C C C C C C C C C C C C C C C
charge: -0.271040 -0.151704 -0.152301 -0.062103 0.341411 0.341911 -0.047369 0.398944 0.400257 -0.143483 -0.109018 -0.164738 -0.143254 -0.135200 -0.144710 -0.125324 -0.137284 0.034585 0.032961 0.037031 0.035307 0.165121
polarizability: 3.76827833e+02 3.67784268e+00 2.67649800e+02 -1.39802607e+01 -8.22368244e-02 1.39321933e+02
1716.lowfreq: -6.9497 -2.5710 -0.0005 0.0002 0.0004 8.0105 28.1627 34.6271 42.2698
frequency: 28.1537 34.6037 42.2574 46.1164 74.8768 79.6516 81.6902 92.8159 98.0337 110.2479 123.7654 134.0583 167.0968 180.3334 197.0735 199.8363 204.1726 217.3005 243.9105 260.4977 285.9904 300.1766 322.4328 349.7740 379.0650 415.0256 421.1166 425.1368 432.3627 469.8463 474.3602 510.5020 523.2154 547.3285 577.2196 622.6213 631.4073 654.7518 673.3244 727.2694 739.7793 748.7412 769.0311 804.1049 808.2109 815.9922 823.1152 835.0925 933.3489 943.7317 944.5070 952.1348 957.3340 962.6704 966.5668 992.2652 999.4944 1011.8779 1056.0500 1056.3886 1109.3521 1109.7287 1110.2199 1111.0590 1111.1469 1132.8324 1135.5450 1146.7964 1162.1477 1166.1124 1179.5343 1203.8369 1217.4659 1263.4580 1263.7111 1303.6211 1317.3412 1332.5266 1360.0929 1361.7219 1368.8280 1374.0741 1417.0188 1424.3566 1426.3453 1438.5823 1440.6188 1444.4031 1458.1609 1459.1021 1462.9295 1463.1564 1473.9847 1474.0180 1475.8683 1489.8669 1493.9556 1497.7551 1505.9897 1508.0473 1526.0749 1532.3838 1550.3666 1559.1764 1626.5091 1631.2370 2934.4942 2936.7319 2942.9460 2945.0348 2970.6488 2998.9232 3001.0805 3001.7174 3004.2474 3066.5711 3090.2529 3094.1655 3101.1213 3103.7597 3106.9043 3135.1340 3138.2630 3145.5923 3152.4000 3162.4030 3162.9820 3168.9375 3181.2467
redmass: 3.3062 4.2663 3.4966 3.1989 2.5272 2.5472 2.9101 2.3096 2.0099 2.4443 1.9575 1.8579 2.1432 2.6928 1.7950 1.2199 1.3086 2.3913 3.6237 3.0160 4.1784 4.6655 4.0142 4.5567 5.1020 3.0478 3.2250 3.2662 3.1354 3.6644 3.5658 2.9345 2.7669 3.3239 3.9863 5.5588 6.7121 4.3878 4.8440 4.5539 4.2793 4.3679 5.6707 1.2696 1.2740 2.2753 1.9037 3.7926 3.1067 3.0651 2.4578 1.3571 1.7146 1.6561 1.3332 4.9777 3.3328 2.9756 1.4872 1.4914 1.2596 1.2719 1.2967 1.2833 1.2548 1.4602 1.5118 1.6480 1.9344 1.6887 1.9289 1.1306 1.2280 2.9003 2.9168 2.2942 1.4547 1.7198 3.4300 3.0843 4.8061 5.5521 1.1860 1.7164 1.5394 1.7356 1.9540 1.0589 1.2234 1.2377 1.0411 1.0434 1.0464 1.0466 1.0647 1.6819 1.0904 1.7064 1.1526 1.1817 2.4101 3.0825 6.4872 7.2602 5.9836 6.2396 1.0367 1.0369 1.0394 1.0395 1.0292 1.0990 1.0994 1.1027 1.1026 1.1046 1.0962 1.0958 1.0939 1.0939 1.1020 1.0878 1.0872 1.0868 1.0876 1.0943 1.0944 1.0958 1.0955
irintensity: 0.3673 1.6504 3.2879 1.1451 0.3388 0.6407 0.5100 1.7254 7.0991 0.4050 0.3248 0.2399 3.1260 0.4734 2.8222 0.3817 0.7681 0.8442 0.1979 2.0963 5.1625 4.1972 1.1187 6.6097 0.3352 3.3206 4.4019 4.5981 0.8378 2.2468 2.1863 14.1682 9.1394 28.4419 5.8735 7.3699 0.2331 14.1002 8.9239 15.9069 1.9375 13.5839 13.2147 7.5737 8.1980 104.1082 79.5193 32.1303 61.9380 10.4536 36.2465 0.4229 29.5431 24.0446 0.5524 74.9444 25.8519 29.5326 26.0033 25.7189 0.3272 0.6888 0.8654 0.6771 0.2536 2.7214 1.5490 18.6419 9.4302 15.8879 8.2912 151.0796 12.4434 28.7375 31.0551 58.5468 11.3591 41.0020 215.6464 142.7968 0.8031 57.9376 4.2505 12.5965 5.6545 1.9719 6.2857 9.6516 10.9324 19.9388 0.3059 0.3290 21.3084 19.5930 29.9183 26.4934 4.2128 25.8094 19.7957 140.6990 131.8032 214.3292 6.4734 15.0057 513.3237 139.7603 112.0004 108.5167 159.4772 102.4798 139.2659 4.7356 9.2195 89.4684 82.7450 50.7577 4.5200 4.1030 55.1187 52.6168 23.5965 18.9086 4.5555 8.5529 15.6688 14.1455 30.9349 12.4124 7.9552
temp: 298.150 k
press: 1.00000 atm
elementType: 8 7 7 7 6 6 6 6 6 6 6 6 6 6 6 6 6 6 6 6 6 6 1 1 1 1 1 1 1 1 1 1 1 1 1 1 1 1 1 1 1 1 1 1 1
symmnumber: 1
zpe: 978823.3 jmol-1
zpe.correction: 0.372814 hartree
zpe.thermalcorrener: 0.396009 hartree
zpe.thermalcorrenthalpy: 0.396954 hartree
zpe.thermalcorrgfe: 0.318922 hartree
zpe.sumelectzpe: -937.491736 hartree
zpe.sumelectthermal: -937.468540 hartree
zpe.sumelectthermalent: -937.467596 hartree
zpe.sumelectthermalfe: -937.545627 hartree
dipole: 0.1219 -3.5564 0.1061
dipole: 3.5601
quadrupole: -81.6837 -114.6131 -132.8430
quadrupole: -0.3752 -3.7396 0.1400
quadrupole: 28.0296 -4.8998 -23.1297 -0.3752 -3.7396 0.1400
hfenergy: -937.8645497 hartree
pointgroup: C01 [X(C18H23N3O1)]
dipole: -0.0042336 -1.377193 -0.2552595 debye
polarizability: 375.8366405|3.107863|264.6629067|-21.1975469|18.8636481|143.3000185 unknown
InChI: InChI=1S/C18H23N3O/c1-20(2)16-10-6-14(7-11-16)18(19-22-5)15-8-12-17(13-9-15)21(3)4/h6-13H,1-5H3
charge 0 multiplicity 1
45 atoms
O  -1.266546 3.289818 0.568648
N  5.149708 -1.181139 -0.206621
N  -4.831168 -1.88767 -0.187751
N  0.047039 2.632331 0.496434
C  1.287897 0.658069 0.124377
C  -1.288259 0.508623 0.178599
C  -0.042411 1.318415 0.279156
C  3.890379 -0.580324 -0.09426
C  -3.67559 -1.108723 -0.068685
C  1.506973 -0.683292 0.541821
C  -2.437172 0.752585 0.982946
C  2.404007 1.366288 -0.401861
C  -1.370281 -0.563196 -0.755365
C  2.769718 -1.293008 0.439507
C  -3.59328 -0.036414 0.877208
C  3.670517 0.771972 -0.513886
C  -2.527136 -1.34885 -0.88928
C  6.284492 -0.416621 -0.736291
C  5.341273 -2.5698 0.225396
C  -5.995877 -1.610373 0.660963
C  -4.891059 -2.964966 -1.182177
C  -1.015218 4.728521 0.716407
H  0.676409 -1.253891 0.971357
H  -2.418021 1.574862 1.702111
H  2.25742 2.401352 -0.72636
H  -0.510939 -0.773592 -1.401592
H  2.884336 -2.323972 0.786286
H  -4.442099 0.190416 1.52875
H  4.49192 1.358778 -0.935017
H  -2.536272 -2.14844 -1.635503
H  6.103646 -0.076474 -1.776817
H  6.502827 0.479984 -0.120199
H  7.184806 -1.051504 -0.740315
H  5.135447 -2.70046 1.308136
H  4.682634 -3.267997 -0.330854
H  6.384685 -2.871156 0.04082
H  -5.754571 -1.715402 1.738433
H  -6.390612 -0.586069 0.500004
H  -6.800511 -2.324454 0.424237
H  -4.115664 -3.737393 -1.000699
H  -5.875579 -3.456484 -1.132481
H  -4.752976 -2.582268 -2.214438
H  -0.454782 5.122197 -0.15149
H  -0.450325 4.937942 1.64332
H  -2.016383 5.18868 0.764024
