program: Gaussian 09
title: 000239135
version: EM64L-G09RevD.01
frameworkgroup: C1[X(C20H13ClO4)]
method: RPBEPBE
basis: SDD
operation: Freq
keyword: #p
keyword: freq=noraman
keyword: PBEPBE/SDD
title: #p freq=noraman PBEPBE/SDD
converged: YES YES NO NO
title: Mulliken charges:
elementType: Cl O O O O C C C C C C C C C C C C C C C C C C C C H H H H H H H H H H H H H
charge: -0.075593 -0.250820 -0.201646 -0.418912 -0.424152 -0.038874 0.266052 0.297391 0.502274 0.067183 0.063543 -0.358245 0.229768 -0.314823 -0.361427 -0.398411 -0.372808 -0.232942 -0.218977 -0.576422 -0.417884 -0.108564 -0.201050 0.323379 -0.259021 0.257416 0.255368 0.274287 0.270156 0.270106 0.236020 0.237770 0.216169 0.256910 0.232194 0.256469 0.360710 0.357406
chargesum: 0.00000
title: Mulliken charges with hydrogens summed into heavy atoms:
elementType: Cl O O O O C C C C C C C C C C C C C C C C C C C C
charge: -0.075593 -0.250820 -0.201646 -0.058202 -0.066746 -0.038874 0.266052 0.297391 0.502274 0.067183 0.063543 -0.100829 0.229768 -0.059455 -0.087139 -0.128255 -0.102702 0.003078 0.018793 -0.360254 -0.160974 -0.108564 0.031144 0.323379 -0.002552
polarizability: 2.44355994e+02 -2.09001769e+01 2.42709168e+02 4.63646798e+00 1.15445537e+01 2.16475374e+02
1716.lowfreq: -3.0597 -0.0008 -0.0005 0.0010 2.4735 5.2610 28.2719 36.4490 43.8774
frequency: 28.2644 36.4466 43.8426 50.2357 63.5834 70.4225 125.1862 140.3736 183.7065 188.8764 202.2068 213.1239 219.5824 253.5876 262.6396 273.2866 296.4521 308.3014 329.4139 348.6956 349.2322 388.1080 406.4922 416.8661 437.6326 456.3382 482.4628 495.5197 511.9299 531.3348 545.5094 564.6957 583.7622 615.1686 639.8807 649.1948 663.9598 677.1218 698.5682 710.6734 726.3885 733.4647 759.4159 780.7264 787.9309 792.7848 797.5268 822.5030 864.5567 887.7907 896.2103 911.6570 924.3715 941.7867 957.4040 962.6849 971.6723 985.0126 988.1043 996.8246 1002.4897 1027.5064 1074.2843 1076.9402 1092.0404 1097.6217 1133.8909 1150.9651 1159.8717 1174.4476 1179.3750 1191.8828 1203.4707 1216.7413 1241.4087 1278.7907 1287.8260 1294.0559 1313.6998 1373.8724 1398.4188 1401.8187 1413.1623 1425.8902 1449.8472 1459.6387 1463.3332 1516.0637 1574.9143 1602.8064 1605.5420 1607.4145 1617.1373 1625.8958 1694.9843 3103.7705 3135.5049 3142.9666 3147.4238 3151.6968 3155.6833 3158.6153 3171.6474 3171.7445 3181.8259 3183.6822 3578.8477 3582.1133
redmass: 8.9648 8.2678 5.7433 5.0580 6.6198 5.9014 7.5589 5.0498 6.0070 6.7050 7.2618 5.2695 6.5767 6.6533 5.7509 6.3166 4.5510 1.3453 4.8396 4.1811 1.2128 5.0186 8.1662 3.3863 3.1483 3.0511 4.0521 4.8342 7.0459 7.4813 7.4110 8.6606 5.2633 4.3843 6.2610 5.6225 4.9734 5.7237 2.4639 6.3336 3.4300 6.6191 2.8517 4.1572 1.8005 1.5069 2.0653 1.5749 5.2677 1.7151 1.7337 1.4968 2.2698 3.6202 2.6990 2.0889 1.4086 3.6091 1.5748 6.3005 1.3372 2.3098 2.2568 2.4332 1.7447 1.7946 1.5418 1.3481 1.6276 1.1556 1.0931 1.4896 2.8356 3.0507 3.7522 1.5057 1.3548 1.8392 2.3349 8.3530 6.4655 8.3158 2.8468 3.7054 2.4845 2.4909 2.4107 2.8962 6.7315 7.0526 7.2491 6.9586 7.2271 6.7484 12.9684 1.0914 1.0861 1.0880 1.0900 1.0920 1.0889 1.0951 1.1000 1.0937 1.0973 1.0959 1.0663 1.0662
irintensity: 0.8525 0.3994 1.0791 1.5234 4.1586 2.1265 0.6415 0.5587 0.1785 0.5710 0.3775 0.1288 0.6790 0.7183 1.6768 4.5263 19.9362 84.5939 4.8987 24.4213 110.0841 5.1968 6.4197 1.3740 5.1410 20.1313 17.1883 0.3757 13.5522 2.4874 20.8221 0.7792 12.3549 4.2095 1.3791 7.4174 15.3466 46.9408 28.2873 20.8173 17.7417 2.6822 22.6974 32.7475 40.5081 39.1542 20.7014 63.1147 104.0053 6.0966 49.1680 3.9228 3.1782 8.6711 29.0756 9.4238 1.1397 3.4127 4.4563 130.3792 0.5236 28.3897 40.6596 92.4718 27.1612 46.6453 237.0831 81.0811 25.9862 9.1332 0.8200 7.8557 20.2627 20.9015 70.3220 10.8435 2.6551 62.5234 29.9797 2.3391 10.4410 3.4622 23.4089 43.3335 21.5386 14.1858 27.6220 52.7768 38.5378 42.3725 6.1326 85.7360 11.0467 158.0813 408.7557 14.8737 1.0807 9.6644 8.2000 1.1139 2.0152 8.2860 20.3694 2.9014 6.8931 3.2576 39.0090 50.9384
temp: 298.150 k
press: 1.00000 atm
elementType: 17 8 8 8 8 6 6 6 6 6 6 6 6 6 6 6 6 6 6 6 6 6 6 6 6 1 1 1 1 1 1 1 1 1 1 1 1 1
symmnumber: 1
zpe: 719225.2 jmol-1
zpe.correction: 0.273938 hartree
zpe.thermalcorrener: 0.294778 hartree
zpe.thermalcorrenthalpy: 0.295722 hartree
zpe.thermalcorrgfe: 0.223583 hartree
zpe.sumelectzpe: -1529.167546 hartree
zpe.sumelectthermal: -1529.146706 hartree
zpe.sumelectthermalent: -1529.145762 hartree
zpe.sumelectthermalfe: -1529.217901 hartree
dipole: -1.5963 1.7569 1.8832
dipole: 3.0301
quadrupole: -159.0794 -124.9429 -149.4106
quadrupole: -7.0725 22.6904 -17.1391
quadrupole: -14.6018 19.5347 -4.9330 -7.0725 22.6904 -17.1391
hfenergy: -1529.4414839 hartree
pointgroup: C01 [X(C20H13Cl1O4)]
dipole: 0.8290754 -0.2829357 -0.8085488 debye
polarizability: 255.0611362|-15.9691912|232.597008|-12.6530722|-5.8895033|215.8823926 unknown
InChI: InChI=1S/C20H13ClO4/c21-13-5-3-4-12(10-13)20(17-9-8-14(22)11-18(17)23)16-7-2-1-6-15(16)19(24)25-20/h1-11,22-23H
charge 0 multiplicity 1
38 atoms
Cl 1.246504 -4.390639 -2.016947
O  -0.663371 0.611431 1.766761
O  -2.346156 1.935437 2.703341
O  2.09242 -0.627878 1.782643
O  4.831245 2.639558 -0.671526
C  -0.262734 0.119969 0.381049
C  -1.411955 0.635255 -0.499578
C  1.097078 0.742286 0.065032
C  -0.268493 -1.419495 0.386409
C  -2.31393 1.379762 0.285977
C  -1.853471 1.394088 1.698157
C  -1.661762 0.433465 -1.869351
C  2.249975 0.365409 0.812464
C  1.255646 1.768088 -0.8991
C  0.417687 -2.107609 -0.644046
C  -1.011685 -2.149047 1.342021
C  -3.477131 1.960695 -0.258199
C  -2.826268 1.012055 -2.429495
C  -3.725422 1.772516 -1.635546
C  3.504141 0.976458 0.585037
C  2.493214 2.390922 -1.144069
C  0.34522 -3.509975 -0.689364
C  -1.066339 -3.557796 1.271126
C  3.620356 1.989347 -0.395026
C  -0.387845 -4.260249 0.24817
H  -0.985217 -0.164092 -2.488813
H  0.384969 2.095218 -1.474764
H  1.017257 -1.560621 -1.378562
H  -1.51491 -1.615562 2.152276
H  -4.158302 2.530956 0.381563
H  -3.040393 0.866184 -3.493952
H  -4.61906 2.206346 -2.096464
H  4.37985 0.666702 1.172656
H  2.601476 3.179858 -1.892161
H  -1.636395 -4.120066 2.018428
H  -0.424002 -5.351529 0.186947
H  2.934256 -0.795968 2.273957
H  5.562345 2.304821 -0.095249
