program: Gaussian 09
title: 000239152
version: EM64L-G09RevD.01
frameworkgroup: C1[X(C21H29N3O)]
method: RPBEPBE
basis: SDD
operation: Freq
keyword: #p
keyword: freq=noraman
keyword: PBEPBE/SDD
title: #p freq=noraman PBEPBE/SDD
converged: YES YES NO NO
title: Mulliken charges:
elementType: O N N N C C C C C C C C C C C C C C C C C C C C C H H H H H H H H H H H H H H H H H H H H H H H H H H H H H
charge: -0.438592 -0.169561 -0.170179 -0.119987 0.449248 0.451010 -0.372358 -0.376946 -0.374444 -0.373784 0.344159 0.339446 -0.032049 -0.371794 -0.392167 -0.384555 -0.385868 -0.430087 -0.377685 -0.410725 -0.415637 -0.668889 -0.667890 -0.668883 -0.670068 0.204538 0.219021 0.220221 0.206267 0.205897 0.222657 0.220547 0.206342 0.224228 0.224543 0.225068 0.225071 0.254862 0.260200 0.253377 0.257003 0.216155 0.247779 0.211883 0.244841 0.216607 0.211599 0.245313 0.215765 0.212872 0.216560 0.246081 0.212454 0.360534
chargesum: 0.00000
title: Mulliken charges with hydrogens summed into heavy atoms:
elementType: O N N N C C C C C C C C C C C C C C C C C C C C C
charge: -0.078058 -0.169561 -0.170179 -0.119987 0.449248 0.451010 0.051201 0.049541 0.054110 0.053105 0.344159 0.339446 -0.032049 -0.147566 -0.167623 -0.159488 -0.160797 -0.175225 -0.117485 -0.157348 -0.158634 0.006929 0.005156 0.005066 0.005027
polarizability: 4.30492125e+02 1.34350031e+00 2.85200213e+02 1.56043088e+01 7.47379506e+00 1.72363271e+02
1716.lowfreq: -3.8598 -0.0008 -0.0005 0.0005 1.6697 4.2309 18.3022 23.7229 28.5957
frequency: 18.1439 23.6774 28.4716 42.3310 50.5486 59.9781 77.2339 101.7593 104.7753 107.6486 112.7124 117.0540 151.4551 164.4771 179.2887 192.8387 197.9111 209.2355 216.1938 220.3269 243.5381 271.7598 278.7865 296.6960 305.2779 341.1610 352.1297 369.3351 413.4144 418.0014 424.8056 426.3390 437.0723 447.8040 454.2205 496.0262 499.2899 515.5430 525.3517 543.2127 569.9844 618.9438 625.2001 641.5569 658.7930 707.7627 734.6215 740.7066 748.9567 780.4118 782.0571 787.5843 790.4788 805.2016 810.8607 819.2052 823.4159 859.6219 892.5183 893.3496 914.8230 914.9456 938.3689 953.5760 957.1855 963.1453 969.6788 997.5999 1005.9337 1020.0752 1021.9700 1066.0650 1067.7032 1083.1375 1083.9585 1093.3268 1094.5245 1134.9943 1137.5017 1149.4997 1158.2561 1166.2789 1205.5568 1205.9121 1207.4434 1220.9018 1268.6736 1273.6065 1274.4529 1294.1752 1294.4246 1306.3195 1318.7206 1336.7601 1340.4699 1341.3702 1347.7321 1349.2230 1363.3256 1370.6882 1382.2965 1383.6502 1387.9998 1389.9091 1392.9624 1394.3348 1433.0317 1437.3459 1462.4095 1463.1699 1471.3200 1471.5429 1475.1984 1475.2962 1485.7079 1486.1553 1487.9603 1488.6697 1499.6150 1501.8925 1508.2682 1517.6894 1534.0524 1547.8193 1560.1743 1623.0430 1628.3379 2981.4251 2982.5781 2983.9191 2984.3843 2984.5079 2984.6335 2986.4654 2986.9543 3035.0403 3035.4828 3041.5949 3042.5773 3078.1809 3078.3635 3081.4928 3081.6852 3092.1884 3093.2348 3096.6554 3096.8577 3134.8565 3137.1544 3144.5932 3154.6662 3162.3172 3163.8140 3168.5306 3183.2737 3561.3942
redmass: 3.6848 3.2608 4.3433 3.2988 3.9063 2.9861 3.7537 3.5774 3.1730 3.0024 3.5628 3.6502 3.9816 2.5849 1.4232 1.4999 1.9205 1.3570 1.4117 1.8152 3.9340 2.6771 2.6498 3.1874 3.4960 3.4455 3.8851 5.3931 2.9736 1.5347 3.0699 3.1537 2.5834 3.0772 2.5368 2.9232 2.8621 3.1094 3.1386 2.7479 3.2425 4.3921 5.6004 5.9011 4.0890 4.2569 3.9025 4.0884 4.2244 1.1403 1.1352 1.2231 1.2818 1.2787 1.2568 1.8184 1.8531 7.8279 2.2538 2.2611 2.1481 2.1476 2.3157 1.3465 1.7641 1.6049 1.3145 3.1702 2.8484 3.1918 2.8998 2.1151 2.1263 1.8442 1.8548 1.6187 1.6133 1.5282 1.6512 2.3244 1.9420 1.8931 1.7878 2.2245 1.3229 1.1659 1.4956 1.4214 1.4006 1.2644 1.2593 2.0511 1.4340 1.6746 1.2553 1.2401 1.4154 1.4055 3.8987 3.6899 1.2689 1.2467 1.2240 1.2737 1.7414 1.8336 3.7714 3.5857 1.0455 1.0476 1.0465 1.0477 1.0590 1.0556 1.0498 1.0500 1.0835 1.0843 1.2474 1.1307 2.5341 2.7399 4.4578 6.4019 7.1300 6.1030 6.3768 1.0572 1.0536 1.0409 1.0489 1.0428 1.0427 1.0489 1.0552 1.1011 1.1015 1.0997 1.0998 1.0992 1.0993 1.0982 1.0982 1.1011 1.1010 1.1010 1.1010 1.0878 1.0873 1.0867 1.0874 1.0939 1.0939 1.0954 1.0954 1.0672
irintensity: 0.5885 0.0043 0.8349 0.6314 0.3878 0.0649 0.4451 0.4146 0.5586 0.1842 0.7584 0.0938 0.1645 0.8463 0.0280 0.1379 0.7666 0.6041 0.1955 0.4575 3.0621 0.0516 3.1618 0.0870 2.9847 2.1933 3.9052 6.3906 13.6394 112.8716 0.9258 18.5773 2.4332 1.0777 6.9713 2.2345 2.4763 0.7181 2.4872 16.8001 15.5210 1.8363 6.8780 0.5642 20.9953 23.6754 0.9455 9.2918 15.9796 4.3998 5.4053 19.0744 9.2245 11.8458 2.1570 72.4538 77.8547 155.7253 0.5575 0.5099 3.7058 2.8067 14.6744 0.3089 5.0868 12.1345 0.2669 3.5892 7.8166 17.8925 49.8336 0.1935 0.1865 55.7359 33.0908 24.6319 24.2560 3.3141 10.0544 31.9397 18.7806 16.3842 75.3068 55.5362 127.7729 33.2089 129.8551 98.7798 41.9318 5.7602 6.9497 41.7591 16.3551 59.3518 24.4352 14.6049 212.4625 62.3198 1.2489 6.4085 18.9795 15.3456 36.2197 60.7713 24.8178 108.9586 8.0335 12.4474 3.4371 3.9935 12.6987 13.2505 0.1087 0.0311 3.6062 2.6797 11.0753 8.1888 34.1279 21.3893 205.0080 105.2733 83.8914 5.3895 27.2095 551.8628 128.3366 19.9209 5.1009 45.7485 49.1223 63.6644 49.0322 98.6086 63.3089 4.1174 3.9240 34.1803 30.5555 65.2639 65.1419 49.3597 44.2533 11.9713 5.1059 89.7308 59.3704 24.2992 2.2343 10.7028 20.2403 24.8192 24.5949 15.1454 8.7776 50.9555
temp: 298.150 k
press: 1.00000 atm
elementType: 8 7 7 7 6 6 6 6 6 6 6 6 6 6 6 6 6 6 6 6 6 6 6 6 6 1 1 1 1 1 1 1 1 1 1 1 1 1 1 1 1 1 1 1 1 1 1 1 1 1 1 1 1 1
symmnumber: 1
zpe: 1203252.0 jmol-1
zpe.correction: 0.458295 hartree
zpe.thermalcorrener: 0.484636 hartree
zpe.thermalcorrenthalpy: 0.485580 hartree
zpe.thermalcorrgfe: 0.400299 hartree
zpe.sumelectzpe: -1055.176089 hartree
zpe.sumelectthermal: -1055.149747 hartree
zpe.sumelectthermalent: -1055.148803 hartree
zpe.sumelectthermalfe: -1055.234084 hartree
dipole: 0.1187 -3.8281 -0.1364
dipole: 3.8323
quadrupole: -102.7500 -140.4043 -152.3589
quadrupole: -0.4265 4.3660 2.2647
quadrupole: 29.0877 -8.5665 -20.5212 -0.4265 4.3660 2.2647
hfenergy: -1055.6343834 hartree
pointgroup: C01 [X(C21H29N3O1)]
dipole: -0.0419482 1.397456 -0.5645237 debye
polarizability: 428.7648044|-8.6484298|267.3938406|-24.8028064|-41.4181423|191.8969633 unknown
InChI: InChI=1S/C21H29N3O/c1-5-23(6-2)19-13-9-17(10-14-19)21(22-25)18-11-15-20(16-12-18)24(7-3)8-4/h9-16,25H,5-8H2,1-4H3
charge 0 multiplicity 1
54 atoms
O  -0.96837 -3.647746 1.645647
N  4.945809 0.941403 -0.812301
N  -5.069137 0.724891 -0.39472
N  0.276891 -2.927163 1.310148
C  3.764838 0.291354 -0.418655
C  -3.824577 0.144423 -0.105675
C  6.164444 0.171062 -1.130961
C  5.038305 2.414465 -0.804807
C  -6.185918 0.643829 0.567996
C  -5.262664 1.531765 -1.616473
C  1.299925 -1.052398 0.306792
C  -1.2755 -1.121769 0.462374
C  0.047857 -1.750766 0.723368
C  3.664317 -1.139133 -0.40026
C  -3.602164 -0.596289 1.101154
C  2.593239 1.023595 -0.039892
C  -2.719327 0.244489 -1.012165
C  2.466798 -1.78191 -0.051448
C  -2.373711 -1.22241 1.362064
C  1.400248 0.365243 0.305698
C  -1.489211 -0.370559 -0.727837
C  6.948589 -0.341158 0.103216
C  5.301766 3.040115 0.588031
C  -6.103805 1.653513 1.740522
C  -4.709683 2.97644 -1.530548
H  6.822563 0.823416 -1.734453
H  5.897702 -0.683603 -1.782846
H  4.110796 2.839031 -1.235301
H  5.855894 2.702042 -1.491917
H  -7.123489 0.814409 0.007051
H  -6.249136 -0.386841 0.967132
H  -4.803731 1.007442 -2.476988
H  -6.348224 1.569868 -1.823366
H  4.524407 -1.758994 -0.668859
H  -4.399156 -0.696371 1.842939
H  2.608613 2.116425 -0.004192
H  -2.816921 0.800622 -1.948523
H  2.418672 -2.875466 -0.050773
H  -2.255807 -1.798207 2.282764
H  0.532712 0.964804 0.602341
H  -0.672903 -0.276158 -1.452366
H  7.319475 0.499526 0.715725
H  6.309629 -0.972152 0.744901
H  7.818887 -0.944078 -0.217745
H  4.519823 2.746771 1.309725
H  6.275871 2.712023 0.991381
H  5.312198 4.144199 0.518096
H  -5.164223 1.528761 2.305944
H  -6.143135 2.693649 1.371643
H  -6.949565 1.502879 2.437558
H  -5.230438 3.554795 -0.747154
H  -3.632215 2.973915 -1.291496
H  -4.848989 3.499477 -2.49542
H  -0.602072 -4.49407 2.009734
