program: Gaussian 09
title: 000239154
version: EM64L-G09RevD.01
frameworkgroup: C1[X(C24H25N3O2)]
method: RPBEPBE
basis: SDD
operation: Freq
keyword: #p
keyword: freq=noraman
keyword: PBEPBE/SDD
title: #p freq=noraman PBEPBE/SDD
converged: YES YES NO NO
title: Mulliken charges:
elementType: O O N N N C C C C C C C C C C C C C C C C C C C C C C C C H H H H H H H H H H H H H H H H H H H H H H H H H
charge: -0.305367 -0.221539 -0.150450 -0.152393 -0.009265 0.322438 0.356566 -0.041008 0.401149 0.402336 -0.387253 -0.370706 -0.400751 -0.399716 -0.367529 -0.380425 -0.355731 -0.367671 -0.646984 -0.646052 -0.646240 -0.645004 0.199269 0.184003 -0.346630 -0.321269 -0.219819 -0.230418 -0.226402 0.252515 0.255433 0.270137 0.258494 0.235241 0.239169 0.237481 0.237358 0.235068 0.216974 0.234545 0.215652 0.239027 0.235244 0.236056 0.217277 0.234799 0.217186 0.235310 0.235670 0.269421 0.279742 0.230370 0.226376 0.228318
chargesum: 0.00000
title: Mulliken charges with hydrogens summed into heavy atoms:
elementType: O O N N N C C C C C C C C C C C C C C C C C C C C C C C C
charge: -0.305367 -0.221539 -0.150450 -0.152393 -0.009265 0.322438 0.356566 -0.041008 0.401149 0.402336 -0.134738 -0.115273 -0.130615 -0.141222 -0.132288 -0.141256 -0.118250 -0.130313 0.039604 0.043871 0.041891 0.043162 0.199269 0.184003 -0.077210 -0.041527 0.010551 -0.004043 0.001916
polarizability: 5.10292114e+02 -1.69038534e+01 3.74839661e+02 1.05296156e+01 2.62612825e+00 1.60151217e+02
1716.lowfreq: -6.1222 -1.3901 -0.0002 0.0003 0.0009 4.8393 18.0569 23.5247 27.0874
frequency: 17.9828 23.5126 27.0756 30.4975 35.2819 44.7028 55.6081 76.0742 79.7317 86.3476 96.5192 105.8285 117.6401 127.3055 138.9787 168.2081 180.0834 183.2315 197.4474 200.5013 202.8751 222.7551 260.0417 268.5860 277.5074 303.1726 329.9023 353.9288 367.7326 405.0496 415.9334 418.9621 425.3354 429.2122 442.2520 469.0230 472.8958 489.2952 513.3026 516.2171 552.2485 579.4422 613.8514 621.0431 622.9209 635.5505 660.7530 670.9002 680.3120 701.5637 728.1273 738.4111 750.8786 760.4842 791.5524 806.5398 811.4180 816.3382 823.9340 827.2479 834.6307 866.0542 936.2587 942.7307 946.3013 953.8555 957.3563 959.9513 967.8131 973.6135 989.5487 994.1051 996.9760 998.3658 1006.4128 1011.9751 1033.3498 1055.0796 1056.7823 1084.4199 1108.0429 1108.1980 1110.4301 1110.7969 1135.0459 1136.7409 1158.6703 1166.2579 1171.9702 1175.5037 1183.0548 1203.9995 1216.9578 1222.4011 1261.1248 1261.2033 1306.7624 1315.6297 1318.1586 1331.7070 1362.5928 1363.4615 1370.0078 1373.4445 1388.0325 1425.5572 1427.1897 1436.7273 1439.4385 1442.1087 1456.5103 1459.1705 1463.2232 1464.3267 1474.7929 1475.5683 1477.1551 1481.5379 1492.8777 1494.5793 1504.8332 1506.6382 1527.5541 1533.5386 1549.3748 1557.0837 1586.9487 1610.6721 1625.7853 1631.0774 1648.7593 2939.8113 2939.8856 2947.5610 2948.5518 3005.3751 3006.0499 3008.6371 3010.7287 3095.3691 3095.4872 3105.3964 3105.7204 3125.8644 3137.5921 3139.1052 3140.6599 3149.3288 3149.5012 3152.5324 3164.9939 3166.1131 3166.6190 3171.6014 3172.4740 3174.2598
redmass: 5.7727 4.3482 4.9727 3.4023 4.6382 3.0008 4.4517 4.1452 2.9993 3.4245 2.3618 2.1440 1.9510 3.1116 2.5200 4.5594 3.7035 4.7647 1.3452 1.9277 1.2638 2.6071 4.0254 5.2598 4.1324 4.5828 4.4086 6.1538 5.5710 2.8497 3.9496 3.1496 3.4895 3.2747 3.7942 3.6764 3.6620 5.0615 2.9433 3.2740 3.1884 4.5092 6.4220 5.7240 5.8731 7.3215 4.1861 4.9355 5.8246 1.6685 5.0610 4.0720 4.4304 6.1562 2.0972 1.2816 1.2525 3.2850 2.2323 4.3266 3.1449 1.2439 3.4774 3.1159 2.3580 1.4200 1.3825 1.8859 1.3524 1.3994 6.2080 4.2695 1.6050 2.5586 1.3225 3.0623 2.1763 1.4961 1.4972 1.5920 1.2461 1.2380 1.3233 1.3137 1.4693 1.5006 2.3238 1.6814 1.0615 1.7203 1.2228 1.1327 1.2346 3.6120 2.9029 2.8883 2.1838 1.3129 1.4534 1.7911 3.2920 3.0582 4.7776 5.1231 9.8460 1.6370 1.4708 2.2504 1.9352 2.1935 1.2775 1.2248 1.0404 1.0403 1.0463 1.0462 2.2835 3.0221 1.0907 1.2270 1.1625 1.1322 2.4197 3.0086 6.4504 7.0899 6.4466 6.0450 5.9467 6.2448 12.3023 1.0367 1.0369 1.0393 1.0393 1.1000 1.0991 1.1030 1.1021 1.0962 1.0963 1.0942 1.0942 1.0852 1.0883 1.0892 1.0875 1.0871 1.0873 1.0939 1.0971 1.0941 1.0941 1.0960 1.0963 1.0982
irintensity: 1.6952 0.3777 1.4101 0.6858 2.1547 0.0417 0.3375 1.1260 0.6127 1.0842 1.0944 5.6999 0.9444 0.0898 1.4497 0.4629 0.1881 0.4690 0.6426 1.5570 0.6157 0.4544 10.7797 5.1371 6.5468 1.2713 2.2128 2.0556 3.0748 0.0349 5.3106 0.1833 0.2706 0.4985 1.5343 3.3901 2.3767 4.2955 15.4690 5.4750 6.7631 10.9973 1.4226 1.2545 5.1259 1.4779 9.9533 24.5257 6.1116 73.0019 10.5482 5.6373 14.1339 25.7900 26.8711 12.3043 6.8141 174.6045 49.4613 8.3651 76.8150 0.7737 56.6715 11.3851 58.7000 5.1511 8.5227 110.1229 13.1347 9.2833 11.2512 199.0310 9.6881 54.1256 0.5070 86.2023 73.4661 25.8546 26.3445 5.6681 0.0873 0.1782 1.3641 0.7863 2.7119 0.9113 43.2493 14.9812 2.9638 57.2793 27.9064 185.5181 17.8054 301.5163 26.8112 26.9913 127.1286 0.5206 17.4349 92.5843 320.1951 83.5964 5.2001 75.0519 1.2924 30.3581 8.4620 11.7354 15.1799 7.2354 29.0412 9.8525 0.0148 0.1160 22.1317 22.5076 3.6482 121.4140 3.9634 29.9562 26.1232 120.8248 112.8714 207.7121 9.7593 35.2530 10.3483 7.4829 630.7298 222.9146 200.1771 91.1656 113.6022 169.0923 98.2295 23.4392 0.0218 84.4405 63.1325 4.1328 4.0390 59.4034 43.9839 0.1842 15.0487 14.3836 2.9492 6.8971 7.4084 20.3945 27.0479 16.8679 25.4527 16.9691 3.0574 15.1870
temp: 298.150 k
press: 1.00000 atm
elementType: 8 8 7 7 7 6 6 6 6 6 6 6 6 6 6 6 6 6 6 6 6 6 6 6 6 6 6 6 6 1 1 1 1 1 1 1 1 1 1 1 1 1 1 1 1 1 1 1 1 1 1 1 1 1
symmnumber: 1
zpe: 1140089.5 jmol-1
zpe.correction: 0.434237 hartree
zpe.thermalcorrener: 0.462362 hartree
zpe.thermalcorrenthalpy: 0.463306 hartree
zpe.thermalcorrgfe: 0.372164 hartree
zpe.sumelectzpe: -1242.129503 hartree
zpe.sumelectthermal: -1242.101379 hartree
zpe.sumelectthermalent: -1242.100434 hartree
zpe.sumelectthermalfe: -1242.191576 hartree
dipole: 2.0329 7.4601 0.6796
dipole: 7.7619
quadrupole: -105.3275 -151.0329 -173.0538
quadrupole: -14.0276 3.2448 -2.3154
quadrupole: 37.8106 -7.8949 -29.9157 -14.0276 3.2448 -2.3154
hfenergy: -1242.5637406 hartree
pointgroup: C01 [X(C24H25N3O2)]
dipole: 0.7669974 -2.9100102 -0.5187756 debye
polarizability: 509.1473387|17.7932092|373.0780428|-23.0985537|18.0546212|163.0576106 unknown
InChI: InChI=1S/C24H25N3O2/c1-26(2)21-14-10-18(11-15-21)23(19-12-16-22(17-13-19)27(3)4)25-29-24(28)20-8-6-5-7-9-20/h5-17H,1-4H3
charge 0 multiplicity 1
54 atoms
O  -1.327827 1.423404 0.346421
O  -1.435715 3.760579 0.701248
N  6.477554 0.736897 -0.138438
N  -1.858852 -4.781854 -0.262156
N  0.156083 1.554406 0.391926
C  2.210574 0.441612 0.094814
C  0.046415 -0.95867 0.104571
C  0.728108 0.360975 0.207476
C  5.086187 0.640936 -0.058122
C  -1.236221 -3.537049 -0.142712
C  3.047069 -0.646102 0.469425
C  -1.024172 -1.337449 0.961594
C  2.846336 1.635533 -0.351795
C  0.460953 -1.903237 -0.875147
C  4.447005 -0.55701 0.398053
C  -1.644385 -2.592115 0.855129
C  4.241561 1.738236 -0.431827
C  -0.162654 -3.154412 -1.010207
C  7.317441 -0.403503 0.247791
C  7.105845 1.988665 -0.580774
C  -1.419502 -5.727184 -1.2961
C  -2.959155 -5.145206 0.639771
C  -3.4722 2.452043 0.389514
C  -1.992815 2.663384 0.499078
C  -4.311171 3.579199 0.589863
C  -4.047037 1.187936 0.092044
C  -5.711608 3.444949 0.497104
C  -5.449392 1.059918 -0.001305
C  -6.284214 2.184627 0.201501
H  2.592826 -1.570758 0.841217
H  -1.362887 -0.641144 1.734335
H  2.218443 2.485554 -0.636538
H  1.277588 -1.64136 -1.556938
H  5.044575 -1.418009 0.710009
H  -2.448482 -2.839683 1.553763
H  4.678964 2.673836 -0.79103
H  0.186638 -3.833527 -1.792797
H  7.18207 -0.674898 1.315046
H  8.377541 -0.146592 0.095558
H  7.094427 -1.302119 -0.362605
H  8.201175 1.874282 -0.564891
H  6.842275 2.838429 0.081014
H  6.806799 2.256794 -1.614508
H  -1.539862 -5.307573 -2.315774
H  -2.024377 -6.645451 -1.234594
H  -0.355154 -6.011808 -1.168567
H  -3.323606 -6.152958 0.385776
H  -3.812701 -4.442486 0.551992
H  -2.635958 -5.157372 1.700662
H  -3.843545 4.543664 0.814477
H  -3.394192 0.325365 -0.070119
H  -6.355518 4.317429 0.653078
H  -5.892143 0.085297 -0.235205
H  -7.372808 2.080684 0.127495
