program: Gaussian 09
title: 000239137
version: EM64L-G09RevD.01
frameworkgroup: C1[X(C23H30N2)]
method: RPBEPBE
basis: SDD
operation: Freq
keyword: #pfreq=noraman
keyword: PBEPBE/SDD
title: #p freq=noraman PBEPBE/SDD
converged: YES YES NO NO
title: Mulliken charges:
elementType: N N C C C C C C C C C C C C C C C C C C C C C C C H H H H H H H H H H H H H H H H H H H H H H H H H H H H H H
charge: -0.155002 -0.154871 -0.146052 -0.439283 -0.443386 -0.433967 -0.214056 -0.436987 0.533868 0.530755 -0.211971 -0.462492 -0.488593 -0.415745 -0.400056 -0.365088 -0.367945 -0.403234 -0.371891 0.397027 0.400806 -0.647474 -0.646701 -0.647359 -0.647487 0.207190 0.223756 0.195610 0.229678 0.200479 0.205371 0.228744 0.207980 0.207071 0.196873 0.224184 0.228898 0.225635 0.239501 0.230801 0.230841 0.230998 0.229078 0.212930 0.230127 0.231478 0.230010 0.213625 0.230476 0.229757 0.230304 0.212599 0.212778 0.230325 0.230085
chargesum: 0.00000
title: Mulliken charges with hydrogens summed into heavy atoms:
elementType: N N C C C C C C C C C C C C C C C C C C C C C C C
charge: -0.155002 -0.154871 0.061139 -0.215527 -0.018098 -0.028117 0.014688 -0.021936 0.533868 0.530755 -0.015098 -0.238309 -0.259695 -0.190110 -0.160554 -0.134288 -0.137104 -0.172236 -0.142812 0.397027 0.400806 0.027061 0.027410 0.025302 0.025702
polarizability: 3.44590163e+02 -6.83762421e+00 2.74086534e+02 -1.12098292e+01 1.48676521e+01 2.09804646e+02
1716.lowfreq: -7.0332 -0.0006 -0.0003 -0.0001 1.0669 7.0383 22.3928 27.6499 33.2644
frequency: 22.2650 27.6202 33.1143 39.0235 51.6975 58.6026 78.1523 79.0220 81.7510 84.7145 115.9689 119.7401 123.6187 167.4038 190.7268 205.6655 206.9484 209.1335 220.9348 231.0381 245.6451 295.1459 305.9565 329.7188 350.5814 393.4020 406.3197 414.8509 417.0717 422.2090 444.8791 464.2369 474.1311 500.7025 514.4211 529.2767 542.2814 552.9788 572.8051 632.8791 636.1539 686.7916 710.9146 719.3052 726.1077 738.5320 749.0820 796.6433 804.9978 806.0226 806.8077 826.8345 830.4645 852.0928 857.0513 891.6270 929.9467 934.0756 937.8098 944.9240 946.1872 950.6618 952.5463 966.6838 984.0362 992.2610 998.8776 999.6231 1055.9268 1057.4415 1063.9618 1084.7352 1099.8557 1109.7759 1109.7934 1112.7035 1112.9765 1126.8826 1128.2021 1138.8572 1158.6682 1162.7504 1165.3241 1189.4264 1197.7813 1212.9885 1217.5186 1225.2363 1238.0939 1253.9245 1257.3563 1266.3910 1266.7489 1304.0369 1306.2393 1329.0690 1332.9159 1335.6882 1338.6558 1346.3800 1354.6907 1357.1388 1375.4763 1384.2108 1386.3043 1422.5530 1423.7350 1435.6396 1437.0742 1453.3618 1458.3349 1459.6840 1462.3368 1462.4284 1468.7509 1472.2335 1472.6600 1474.2636 1495.1254 1495.4545 1507.5092 1507.8605 1522.1321 1526.7668 1564.0147 1565.5594 1631.2880 1634.2331 1668.3699 2927.3127 2928.3107 2936.6259 2937.5645 2945.9439 2946.7256 2975.1025 2977.6605 2981.3926 2989.5630 2990.1884 2992.1662 2993.0038 3001.9287 3037.8629 3050.9545 3087.2870 3088.4457 3090.1212 3097.8074 3099.8755 3110.6047 3113.4789 3116.5965 3123.7032 3127.6005 3155.5381 3155.8350 3159.9142 3160.2772
redmass: 3.9844 3.1783 3.6872 3.5337 3.5027 3.3156 2.6087 2.4060 2.5089 2.4411 3.3498 2.2615 1.9294 3.6116 2.7850 1.2325 1.1191 2.0914 2.4164 2.1068 2.7383 3.0942 2.7489 3.6300 3.0934 4.3045 3.0089 2.9610 2.9733 3.3397 2.3458 3.5642 3.5419 3.5985 2.7776 2.7731 2.9153 2.8136 3.5578 6.2995 6.5293 2.0833 3.1313 2.7676 1.9051 3.4662 4.0421 2.7141 1.2785 1.2716 1.9317 2.6658 2.2422 4.2461 1.9943 2.1182 2.2393 1.5196 1.4299 2.9632 3.0817 1.3714 1.3627 2.4796 1.2643 2.6364 2.9077 2.8752 1.4780 1.4843 1.8235 1.8046 2.0379 1.3147 1.3144 1.2390 1.2389 1.5048 1.4208 1.0986 1.2595 1.8592 1.7546 1.7408 1.2589 1.3310 1.5499 1.3753 1.2321 1.3782 1.5024 2.7408 2.8356 1.4758 1.5864 1.3589 1.4309 1.4158 1.4810 1.5461 3.3322 3.2781 5.0181 3.8105 1.5756 2.0011 1.9666 1.4576 1.4728 1.0881 1.2121 1.2072 1.0426 1.0432 1.0838 1.0467 1.0466 1.0913 1.0809 1.0827 1.1190 1.1181 2.4224 2.4912 6.6055 6.3378 6.1763 6.2761 6.6680 1.0370 1.0371 1.0398 1.0399 1.0787 1.0642 1.0781 1.0679 1.0702 1.0986 1.0990 1.1027 1.1028 1.0906 1.1002 1.0982 1.0956 1.0851 1.0953 1.0934 1.0933 1.0889 1.0888 1.0877 1.0875 1.0970 1.0925 1.0927 1.0934 1.0936
irintensity: 0.7076 0.0330 0.4182 0.6175 1.5537 0.7571 1.6942 0.4969 4.1569 3.3807 0.1936 0.0038 0.0485 0.5388 0.1932 0.2103 0.0069 0.2273 0.9267 0.9445 0.6202 0.6457 1.9533 0.9719 0.7703 3.1238 1.3287 0.2766 0.5284 0.7687 4.0030 5.7838 0.6207 1.7325 5.9238 3.7675 23.6114 19.9994 9.8454 1.3748 1.1879 16.3326 10.5428 0.0695 20.1984 5.0798 16.3090 41.3409 2.2392 1.7524 47.9647 23.2112 12.8604 0.8695 5.2729 25.6156 1.3570 0.8036 0.7471 12.9471 29.6185 0.5271 0.3288 1.8098 2.1250 3.5215 1.6718 0.4442 25.9342 25.6918 7.3674 0.4432 0.4312 1.1546 1.3721 0.0607 0.0128 1.8025 1.9251 4.1480 12.2557 11.9866 20.2559 4.0851 33.7792 6.8846 10.0867 8.1307 3.5956 5.4565 2.5626 33.4169 32.4853 3.7090 7.6788 6.0483 9.1741 3.1803 3.0220 0.0062 161.6418 109.6428 11.7993 2.6560 0.9740 8.5223 2.8092 0.8187 0.3013 6.6973 17.7571 14.4145 0.2779 0.5239 8.5619 19.1240 19.6301 11.4536 2.2336 1.8363 27.6447 17.7481 452.8599 190.3661 4.6874 7.7499 209.8401 100.5300 2.5574 117.5527 131.7627 129.2345 84.9156 19.9498 45.2463 13.9920 21.5892 50.4815 2.2831 5.5660 97.2725 96.9320 53.3824 75.1992 44.6533 4.3143 18.8481 4.6474 59.7312 58.0477 11.0060 18.7156 26.0322 11.6479 45.1692 14.9876 44.1838 18.1546 7.2746
temp: 298.150 k
press: 1.00000 atm
elementType: 7 7 6 6 6 6 6 6 6 6 6 6 6 6 6 6 6 6 6 6 6 6 6 6 6 1 1 1 1 1 1 1 1 1 1 1 1 1 1 1 1 1 1 1 1 1 1 1 1 1 1 1 1 1 1
symmnumber: 1
zpe: 1241834.9 jmol-1
zpe.correction: 0.472990 hartree
zpe.thermalcorrener: 0.498372 hartree
zpe.thermalcorrenthalpy: 0.499316 hartree
zpe.thermalcorrgfe: 0.415631 hartree
zpe.sumelectzpe: -1002.054586 hartree
zpe.sumelectthermal: -1002.029204 hartree
zpe.sumelectthermalent: -1002.028260 hartree
zpe.sumelectthermalfe: -1002.111945 hartree
dipole: 0.5179 -2.6900 -0.0502
dipole: 2.7399
quadrupole: -115.6091 -141.5918 -144.2107
quadrupole: 0.1613 -2.8097 3.9300
quadrupole: 18.1948 -7.7880 -10.4068 0.1613 -2.8097 3.9300
hfenergy: -1002.5275757 hartree
pointgroup: C01 [X(C23H30N2)]
dipole: -0.1874463 -1.0597864 0.0606179 debye
polarizability: 343.3726469|6.7842412|273.258985|-16.1882376|-17.3060883|211.849711 unknown
InChI: InChI=1S/C23H30N2/c1-24(2)21-14-10-19(11-15-21)23(18-8-6-5-7-9-18)20-12-16-22(17-13-20)25(3)4/h6,8,10-18,23H,5,7,9H2,1-4H3
charge 0 multiplicity 1
55 atoms
N  -4.926642 -2.102438 0.18374
N  4.695065 -2.396285 -0.037834
C  0.108482 2.24089 0.698795
C  -0.024349 1.025071 -0.301951
C  -1.05812 3.259819 0.563802
C  -0.843628 4.230412 -0.621207
C  1.448927 2.946103 0.545575
C  0.440022 5.068842 -0.418297
C  -1.334553 0.24203 -0.137867
C  1.201263 0.098551 -0.233325
C  1.5954 4.210649 0.065912
C  -1.936455 -0.360539 -1.271559
C  2.230488 0.187138 -1.202495
C  -1.975569 0.032136 1.109375
C  1.372876 -0.854426 0.802155
C  -3.110484 -1.131187 -1.181435
C  3.380948 -0.62456 -1.151645
C  -3.152401 -0.73422 1.226845
C  2.515693 -1.673954 0.877268
C  -3.753385 -1.340247 0.07973
C  3.554954 -1.580114 -0.102157
C  -5.516934 -2.704384 -1.015423
C  -5.56312 -2.293113 1.49015
C  5.726545 -2.293886 -1.073672
C  4.831779 -3.380546 1.039613
H  0.0858 1.811678 1.723901
H  -0.029394 1.466177 -1.320006
H  -1.122285 3.853294 1.498674
H  -2.018173 2.724511 0.453063
H  -1.721527 4.894811 -0.735167
H  -0.758139 3.651701 -1.562428
H  2.33943 2.382103 0.851836
H  0.250778 5.880753 0.31716
H  0.721735 5.57874 -1.361909
H  2.601683 4.652252 0.019466
H  -1.466878 -0.227995 -2.255168
H  2.134927 0.917294 -2.016476
H  -1.5646 0.486323 2.019409
H  0.587236 -0.978919 1.556875
H  -3.526925 -1.567961 -2.093881
H  4.140664 -0.512854 -1.93089
H  -3.604957 -0.855196 2.215615
H  2.59243 -2.397415 1.694466
H  -6.425239 -3.262434 -0.737071
H  -5.805341 -1.938312 -1.765421
H  -4.820479 -3.413951 -1.508948
H  -5.874718 -1.329445 1.945115
H  -6.463587 -2.916957 1.372296
H  -4.888906 -2.803117 2.209646
H  5.327803 -2.52906 -2.083061
H  6.171153 -1.277737 -1.11561
H  6.537891 -3.00717 -0.856623
H  5.787778 -3.916995 0.927777
H  4.827335 -2.900782 2.040426
H  4.015099 -4.132879 1.02334
