program: Gaussian 09
title: 000239105
version: EM64L-G09RevD.01
frameworkgroup: C1[X(C16H18O4)]
method: RPBEPBE
basis: SDD
operation: Freq
keyword: #pfreq=noraman
keyword: PBEPBE/SDD
title: #p freq=noraman PBEPBE/SDD
converged: NO YES NO NO
title: Mulliken charges:
elementType: O O O O C C C C C C C C C C C C C C C C H H H H H H H H H H H H H H H H H H
charge: -0.458043 -0.529726 -0.439835 -0.428198 -0.368336 -0.434160 0.394522 0.399374 -0.355026 0.084444 0.184115 -0.349218 -0.308146 -0.702013 -0.527106 -0.561005 -0.417011 -0.406379 0.318226 0.312970 0.242257 0.183491 0.209791 0.194934 0.228892 0.220463 0.227181 0.208090 0.219414 0.209407 0.239205 0.215068 0.246364 0.253370 0.409800 0.376874 0.351962 0.353986
chargesum: 0.00000
title: Mulliken charges with hydrogens summed into heavy atoms:
elementType: O O O O C C C C C C C C C C C C C C C C
charge: -0.048243 -0.152852 -0.087872 -0.074212 -0.126079 -0.040877 0.394522 0.399374 0.068801 0.084444 0.184115 -0.128755 -0.080964 -0.065102 -0.287902 -0.345937 -0.170647 -0.153009 0.318226 0.312970
polarizability: 2.29048530e+02 -1.83082226e+00 1.64270765e+02 -7.69429740e+00 -1.62006549e+01 1.72005787e+02
1716.lowfreq: -13.1336 -8.7893 -3.5969 -0.0007 -0.0003 0.0006 22.9385 37.1989 55.7512
frequency: 22.5561 37.1939 55.7384 69.3454 88.5175 97.6856 126.5227 173.2771 200.7532 212.7928 224.5704 227.5391 237.4154 255.9185 282.8916 318.9380 321.3398 334.3983 342.6699 350.6084 355.2852 371.8916 437.9492 446.9307 462.9232 488.8687 499.8322 519.8057 535.1560 569.0140 598.1361 606.1722 616.5104 688.7690 702.1199 707.4440 721.9949 731.8331 736.5399 766.4743 791.7211 796.4041 818.0827 832.2603 837.0720 888.9429 901.8362 939.3442 942.9037 951.5759 952.6788 1019.1935 1059.8838 1062.2102 1074.7562 1104.5841 1112.4766 1128.9669 1138.2383 1150.3281 1169.3705 1169.9716 1173.9826 1195.5890 1220.4355 1239.8863 1267.3602 1274.3918 1282.7013 1288.7358 1301.0869 1319.1694 1338.8083 1345.9353 1356.1038 1390.2079 1399.6478 1407.4084 1428.5186 1462.7198 1471.4148 1475.8113 1477.7457 1488.5252 1492.2889 1511.0495 1597.8292 1602.9179 1630.8216 1636.0542 2969.8324 2972.4059 2978.8734 2989.2759 3017.8392 3040.0741 3068.2145 3072.3662 3103.4055 3130.3752 3137.7841 3146.7659 3174.9653 3178.8309 3261.1081 3583.8849 3586.2866 3614.7180
redmass: 5.1415 7.1117 3.5520 4.0733 1.9549 3.4258 4.6010 6.3346 4.5586 1.9752 6.1222 4.6429 1.6094 5.5907 2.7279 2.8694 1.3214 2.0601 4.3717 2.0129 1.2787 3.0314 2.8016 2.9082 3.8957 4.3447 5.9108 5.8323 5.9812 6.5632 3.4644 3.7506 4.0053 3.0353 2.7209 1.2446 5.3730 4.2233 1.6835 1.5692 1.8354 1.8462 1.9433 2.0193 1.6880 1.3681 1.7695 1.3878 3.8863 1.6280 2.5879 4.1037 2.1840 2.4969 1.7438 2.0889 2.2197 1.6799 1.5899 1.2185 1.2820 1.3732 1.7112 1.8507 1.4753 1.6600 1.7420 2.2220 1.3463 1.8116 1.6165 1.5341 1.6796 1.4284 1.5357 1.2189 4.6776 2.5538 3.3900 2.6762 1.0747 1.0611 1.0605 1.2917 2.0510 2.9114 6.3302 6.5668 6.2493 6.7666 1.0434 1.0539 1.0630 1.0805 1.0961 1.1015 1.1010 1.0991 1.0916 1.0884 1.0919 1.0889 1.0951 1.0958 1.0699 1.0660 1.0662 1.0661
irintensity: 1.4737 0.4888 0.1633 0.9806 0.0610 0.1278 1.6976 1.7802 1.8560 1.9348 0.1221 0.3566 0.3302 4.4039 3.2464 66.5224 93.0217 59.5666 13.4952 9.8095 127.1976 14.6852 25.9253 9.1726 1.7563 25.8489 34.3270 6.6423 13.2910 8.1914 17.9648 8.0211 18.5103 3.4083 8.1378 150.1254 7.5530 26.0741 6.4965 4.4717 38.8041 14.1581 30.5442 17.8181 42.7028 1.2218 6.1154 2.4809 42.9349 10.7427 31.1511 2.9066 35.6336 5.7492 10.5055 9.0547 86.4767 357.9463 148.7868 32.8301 31.5734 19.3085 12.1954 35.7613 3.4740 5.8933 14.1623 120.3313 19.4795 11.9626 30.5230 27.3724 16.6735 10.5450 3.5812 14.3807 7.4069 28.5546 23.2428 13.8322 1.6460 15.5271 3.0134 54.6438 97.2448 80.7185 27.3681 87.6917 143.9041 43.3910 25.5442 15.4866 46.6488 15.0642 7.6916 15.7638 80.8868 49.7986 15.4332 14.6401 8.0636 8.3626 6.9285 4.4396 655.9401 37.8001 41.7443 43.2662
temp: 298.150 k
press: 1.00000 atm
elementType: 8 8 8 8 6 6 6 6 6 6 6 6 6 6 6 6 6 6 6 6 1 1 1 1 1 1 1 1 1 1 1 1 1 1 1 1 1 1
symmnumber: 1
zpe: 798455.1 jmol-1
zpe.correction: 0.304116 hartree
zpe.thermalcorrener: 0.323478 hartree
zpe.thermalcorrenthalpy: 0.324422 hartree
zpe.thermalcorrgfe: 0.256340 hartree
zpe.sumelectzpe: -919.918337 hartree
zpe.sumelectthermal: -919.898974 hartree
zpe.sumelectthermalent: -919.898030 hartree
zpe.sumelectthermalfe: -919.966112 hartree
dipole: -4.0387 -0.4589 2.6565
dipole: 4.8558
quadrupole: -110.8033 -112.1647 -115.7894
quadrupole: 6.6595 -10.7612 -9.6478
quadrupole: 2.1158 0.7544 -2.8703 6.6595 -10.7612 -9.6478
hfenergy: -920.2224521 hartree
pointgroup: C01 [X(C16H18O4)]
dipole: 1.475103 -0.0504688 -1.2129673 debye
polarizability: 227.1563979|3.5509522|159.8785957|-12.2814069|14.2951077|178.2900876 unknown
InChI: InChI=1S/C16H18O4/c1-2-3-12(13-6-4-10(17)8-15(13)19)14-7-5-11(18)9-16(14)20/h4-9,12,17-20H,2-3H2,1H3
charge 0 multiplicity 1
38 atoms
O  -1.233334 -0.929278 -2.251141
O  1.347998 -0.10643 -2.504093
O  -4.372187 -2.60314 1.042616
O  5.117783 -1.392672 0.410693
C  -0.089201 1.060285 -0.335484
C  -0.191572 2.426944 0.40234
C  -1.215198 0.072854 0.02822
C  1.294334 0.416316 -0.144663
C  -1.455559 3.230896 0.025308
C  -1.71487 -0.849629 -0.941415
C  1.993575 -0.155933 -1.233597
C  -1.789787 0.024126 1.323083
C  1.928513 0.332238 1.120967
C  -1.525019 4.592094 0.750387
C  -2.770733 -1.738257 -0.627658
C  3.262271 -0.762084 -1.101772
C  -2.829844 -0.862781 1.661625
C  3.190272 -0.266278 1.298008
C  -3.323419 -1.740035 0.669401
C  3.859521 -0.811556 0.17951
H  -0.192215 1.302227 -1.411757
H  -0.163746 2.290439 1.501741
H  0.70852 3.021597 0.14774
H  -1.466822 3.393234 -1.071958
H  -2.3578 2.635053 0.26046
H  -1.427264 0.713767 2.093612
H  1.417311 0.74808 1.99521
H  -0.644794 5.218655 0.510882
H  -2.430318 5.156707 0.461367
H  -1.550276 4.456355 1.848512
H  -3.124309 -2.418477 -1.41144
H  3.770476 -1.19522 -1.974831
H  -3.267674 -0.883313 2.663056
H  3.666453 -0.323069 2.280326
H  -0.327048 -0.51172 -2.372182
H  1.909616 -0.49221 -3.218001
H  -4.644919 -3.16842 0.278047
H  5.503566 -1.761162 -0.422121
