program: Gaussian 09
title: 000239097
version: EM64L-G09RevD.01
frameworkgroup: C1[X(C10H16O)]
method: RPBEPBE
basis: SDD
operation: Freq
keyword: #pfreq=noraman
keyword: PBEPBE/SDD
title: #p freq=noraman PBEPBE/SDD
converged: NO YES NO NO
title: Mulliken charges:
elementType: O C C C C C C C C C C H H H H H H H H H H H H H H H H
charge: -0.237602 0.129195 0.468592 -0.538299 -0.430986 -0.499096 -0.717986 -0.698892 -0.731610 -0.507093 0.162527 0.226488 0.226487 0.209160 0.216757 0.248391 0.224615 0.225208 0.216319 0.226183 0.208460 0.228472 0.217643 0.219429 0.225111 0.214586 0.267940
chargesum: 0.00000
title: Mulliken charges with hydrogens summed into heavy atoms:
elementType: O C C C C C C C C C C
charge: -0.237602 0.129195 0.468592 -0.085324 -0.005069 -0.026089 -0.050275 -0.044317 -0.072484 -0.239153 0.162527
polarizability: 1.36739645e+02 -1.01286412e+01 1.09698661e+02 -1.79590158e-02 1.86489822e+00 8.28942844e+01
1716.lowfreq: -9.2588 -0.0008 -0.0007 -0.0005 5.7012 12.4583 48.2617 87.0979 132.7260
frequency: 48.1673 86.9609 132.7124 190.6977 207.0618 247.2548 262.7475 280.0157 283.0922 311.6297 337.8389 370.3407 414.8698 435.9789 458.0382 497.9944 534.0472 584.8773 619.6286 745.7040 777.8328 836.7033 866.0128 896.9609 909.2852 923.2435 931.3254 943.5122 962.0516 1013.0587 1019.5458 1039.5114 1056.7462 1092.8354 1130.5882 1183.6238 1197.9742 1214.9239 1241.3811 1254.8849 1272.9506 1304.0431 1316.6397 1339.6328 1364.4521 1372.7708 1380.7943 1405.7859 1435.0580 1446.2482 1463.4594 1468.3753 1470.8138 1472.5551 1483.9193 1487.9675 1500.1624 1578.8796 1620.7784 2953.8382 2968.0896 2977.7010 2978.1441 2982.7725 2989.2388 3032.2439 3049.4338 3065.3192 3073.2176 3073.7211 3076.6437 3081.4321 3082.8985 3084.9245 3155.1695
redmass: 3.4872 2.5026 3.4586 2.1542 1.4411 1.7690 1.1853 2.1528 1.8648 1.3307 2.4624 2.2512 3.3207 2.5273 3.1363 3.3688 2.4715 3.0009 3.2946 2.1990 3.6906 1.8775 2.0565 2.7786 1.5579 1.5413 1.6588 1.2010 2.2316 1.5156 1.5388 1.8068 2.0836 1.6482 1.2042 1.7676 2.8021 2.5304 1.4349 2.1497 1.6454 1.7193 1.4984 2.0598 1.6133 1.1825 1.2090 1.2000 1.0847 1.0825 1.0534 1.0525 1.0639 1.0734 1.0541 1.0526 1.0638 9.7828 6.7686 1.0670 1.0667 1.0344 1.0350 1.0358 1.0610 1.0907 1.1017 1.0953 1.0998 1.1001 1.1007 1.0989 1.0993 1.0992 1.0903
irintensity: 1.8162 0.8932 1.1236 1.9638 1.3490 0.0638 0.1051 0.2220 0.1657 0.4524 1.3545 0.8124 4.7799 1.3852 1.6888 6.1781 1.9424 4.9204 0.3623 4.9732 2.3860 4.3335 13.7679 2.2715 9.7899 12.9166 2.4552 0.2070 13.7129 6.4620 3.2116 0.1634 0.9037 1.8632 9.3716 15.9068 4.8131 5.9771 25.2744 42.9282 42.2585 4.9306 10.5257 25.9900 2.4761 20.6730 17.3757 9.6820 13.1829 7.6538 0.8351 0.6140 5.1813 6.9217 13.9997 12.9419 28.8268 146.9733 164.8103 16.3772 13.3896 31.8149 30.3609 23.0711 37.6539 31.7175 43.2996 21.3705 3.9470 6.9755 7.5840 83.6927 44.2036 55.8701 6.3903
temp: 298.150 k
press: 1.00000 atm
elementType: 8 6 6 6 6 6 6 6 6 6 6 1 1 1 1 1 1 1 1 1 1 1 1 1 1 1 1
symmnumber: 1
zpe: 618180.6 jmol-1
zpe.correction: 0.235453 hartree
zpe.thermalcorrener: 0.247213 hartree
zpe.thermalcorrenthalpy: 0.248157 hartree
zpe.thermalcorrgfe: 0.198519 hartree
zpe.sumelectzpe: -465.012747 hartree
zpe.sumelectthermal: -465.000986 hartree
zpe.sumelectthermalent: -465.000042 hartree
zpe.sumelectthermalfe: -465.049680 hartree
dipole: 3.6051 -3.4009 -0.2874
dipole: 4.9645
quadrupole: -75.1815 -71.4713 -67.4724
quadrupole: 10.6783 0.7041 0.2318
quadrupole: -3.8065 -0.0962 3.9027 10.6783 0.7041 0.2318
hfenergy: -465.2481997 hartree
pointgroup: C01 [X(C10H16O1)]
dipole: 1.4695875 -1.2705414 -0.2022482 debye
polarizability: 137.4992333|-8.9422504|108.6162648|-1.1677962|3.4534334|83.2170918 unknown
InChI: InChI=1S/C10H16O/c1-10(2,3)8-5-4-6-9(11)7-8/h7H,4-6H2,1-3H3
charge 0 multiplicity 1
27 atoms
O  -2.888161 1.595546 0.175648
C  1.867389 0.205011 0.003072
C  0.354106 -0.086207 -0.037407
C  -0.08319 -1.529777 -0.276383
C  -1.492729 -1.823629 0.28334
C  -2.512816 -0.787943 -0.233624
C  2.543392 -0.398032 -1.266857
C  2.481159 -0.463652 1.274977
C  2.18378 1.721736 0.054036
C  -0.597165 0.892488 0.120746
C  -2.054392 0.645599 0.046731
H  -0.075708 -1.725986 -1.370382
H  0.65108 -2.232303 0.159266
H  -1.807536 -2.845722 0.000501
H  -1.460597 -1.785415 1.389842
H  -3.515334 -0.927454 0.20737
H  -2.62961 -0.891833 -1.333444
H  2.137565 0.060896 -2.187127
H  3.631281 -0.203012 -1.23794
H  2.401134 -1.491079 -1.333802
H  2.338654 -1.559109 1.28143
H  2.028362 -0.050733 2.194408
H  3.568889 -0.267478 1.307797
H  1.793205 2.191773 0.974721
H  1.758543 2.255549 -0.81517
H  3.278815 1.871175 0.042532
H  -0.32242 1.938493 0.291417
