program: Gaussian 09
title: 000239117
version: EM64L-G09RevD.01
frameworkgroup: C1[X(C26H32N2)]
method: RPBEPBE
basis: SDD
operation: Freq
keyword: #pfreq=noraman
keyword: PBEPBE/SDD
title: #p freq=noraman PBEPBE/SDD
converged: YES YES NO NO
title: Mulliken charges:
elementType: N N C C C C C C C C C C C C C C C C C C C C C C C C C C H H H H H H H H H H H H H H H H H H H H H H H H H H H H H H H H
charge: -0.154190 -0.154385 -0.500231 0.452905 0.474509 0.466530 0.551411 -0.233221 -0.426212 -0.406896 -0.478726 -0.425099 -0.457919 -0.451857 -0.398640 -0.399402 0.397323 0.396912 -0.696085 -0.694978 -0.369503 -0.370546 -0.377983 -0.377905 -0.647361 -0.647331 -0.647237 -0.647287 0.210756 0.205727 0.233177 0.254267 0.226438 0.223589 0.228595 0.227964 0.247053 0.249448 0.226541 0.208431 0.211494 0.211336 0.207959 0.226908 0.231295 0.231475 0.231662 0.231389 0.230366 0.213178 0.230702 0.231120 0.230612 0.213156 0.231126 0.229974 0.213098 0.230512 0.213073 0.230983
chargesum: 0.00000
title: Mulliken charges with hydrogens summed into heavy atoms:
elementType: N N C C C C C C C C C C C C C C C C C C C C C C C C C C
charge: -0.154190 -0.154385 -0.289475 0.452905 0.474509 0.466530 0.551411 -0.027494 -0.193035 -0.152629 -0.252287 -0.201510 -0.229324 -0.223893 -0.151588 -0.149954 0.397323 0.396912 -0.049619 -0.048774 -0.138209 -0.139071 -0.146321 -0.146516 0.026885 0.027557 0.026960 0.027280
polarizability: 3.62060636e+02 -8.21700157e+00 3.40853657e+02 -4.57931888e+00 -1.61554754e+00 2.38427715e+02
1716.lowfreq: -8.9313 -6.2709 -3.7686 0.0002 0.0003 0.0005 13.1694 16.5559 24.3263
frequency: 12.3915 16.3813 24.2462 25.5186 29.9866 37.7044 44.9481 71.1223 76.4555 77.5596 83.6563 95.9373 108.5218 116.7395 158.0564 169.5925 176.1647 200.7616 201.7355 208.4023 213.5419 226.7317 228.8446 239.5280 255.2741 284.6900 300.9036 315.0131 339.5359 358.3774 376.3476 406.0416 415.6979 418.3639 420.7166 425.1855 465.1873 468.3751 475.9718 515.9903 521.7174 532.1586 561.4658 568.9519 589.5611 630.3358 633.7888 635.5028 705.7234 713.9075 716.6486 743.2362 748.9638 758.3363 793.4706 806.1146 809.9826 812.3561 822.1192 846.9631 853.6952 860.6024 872.0676 889.9047 915.8410 940.3122 943.0137 945.0141 946.1156 953.2278 957.3086 959.1507 963.6826 978.4707 998.4427 999.6856 1012.2798 1052.0713 1054.5098 1056.4811 1109.0995 1109.5443 1109.5886 1111.9793 1112.0055 1114.2569 1127.6059 1131.6016 1154.8267 1159.1669 1163.9771 1174.0052 1189.5751 1195.0370 1202.4970 1213.7038 1216.2277 1220.2909 1261.2839 1263.8453 1265.7756 1266.1417 1293.4332 1307.7650 1319.5729 1333.3378 1338.7400 1355.2526 1356.2829 1371.1750 1375.6181 1384.1485 1385.3931 1395.4954 1410.7997 1421.5798 1423.4045 1434.9999 1436.1704 1457.0855 1458.7522 1461.1497 1462.8515 1465.3380 1468.0006 1471.7682 1473.1515 1478.3133 1484.1211 1494.4774 1495.0739 1503.4574 1507.1767 1507.1871 1522.8013 1526.5150 1563.1109 1567.0313 1579.5775 1619.1002 1631.8614 1633.6691 2928.7562 2928.9031 2937.8067 2938.2719 2955.9790 2971.7553 2974.5699 2975.9714 2991.0552 2991.1462 2993.6675 2993.7345 3064.2038 3071.4249 3075.7078 3080.3094 3087.4660 3089.4929 3098.2742 3099.5199 3103.8715 3109.8601 3111.4262 3112.3813 3128.0870 3128.6953 3130.3466 3142.6841 3156.4916 3157.0162 3160.7389 3161.5953
redmass: 2.9588 3.1723 4.1608 3.8825 3.3733 3.8536 3.3496 2.3492 2.6753 2.8424 2.6613 3.6548 1.9387 1.9724 3.4515 3.4426 3.2252 1.1476 2.1537 1.1558 1.3391 1.8975 1.9517 1.9316 1.5816 3.3776 3.5088 3.2023 4.2249 3.9273 3.7685 2.8455 2.9501 3.0872 3.2398 3.7002 3.2636 3.5628 3.3841 2.7883 2.6777 3.0886 2.8048 2.8694 3.1911 6.4356 7.0343 6.8571 3.3959 3.4273 3.9490 3.9746 4.0683 4.2414 2.6515 1.3227 1.3020 1.8027 2.0337 1.9897 1.5337 3.7662 2.6153 2.5459 1.1842 1.4183 1.8182 2.1178 2.8656 1.4483 1.3500 1.3844 1.3654 1.3674 3.0932 2.9552 3.0415 1.5347 1.4804 1.4814 1.3145 1.4897 1.3714 1.2405 1.2409 2.5442 1.4874 1.4877 1.7803 2.1230 1.7501 1.9673 1.1682 1.2970 1.5155 1.4647 1.5459 1.9618 1.8786 1.7456 2.4724 2.6564 1.7197 1.3228 1.5247 1.4438 1.4388 3.3070 3.3119 4.4952 1.1974 4.3991 4.1124 1.2442 2.4651 1.9673 1.9360 1.5163 1.4909 1.2143 1.2128 1.0408 1.0406 1.0452 1.0511 1.0467 1.0464 1.0480 1.1345 1.0823 1.0813 2.2168 1.1125 1.1204 2.4776 2.5025 6.7638 6.4929 6.4718 6.3530 6.1265 6.2641 1.0368 1.0370 1.0396 1.0398 1.0823 1.0349 1.0551 1.0631 1.0988 1.0988 1.1029 1.1029 1.1000 1.0992 1.1004 1.0995 1.0957 1.0954 1.0935 1.0934 1.0866 1.0890 1.0890 1.0875 1.0952 1.0887 1.0879 1.0952 1.0928 1.0926 1.0938 1.0939
irintensity: 0.0427 0.0598 0.7006 0.5561 0.3550 1.3926 0.0217 0.0962 4.0806 4.5303 1.2795 0.2125 0.1401 0.1195 0.2400 0.9199 0.7778 0.0152 0.0739 0.0667 0.5182 1.3148 0.5777 0.1312 0.0423 0.2620 1.4022 0.7911 2.7386 1.4751 1.2837 0.4442 0.5033 0.8541 0.8098 0.9998 0.9122 4.3241 1.5468 7.8542 8.4017 6.6264 25.2928 28.4729 8.1270 1.3487 0.2415 0.5073 3.8179 0.5921 3.1944 4.5294 4.8272 0.0624 32.4675 11.0944 2.0893 59.7755 38.8851 16.7870 4.4616 4.0111 17.4080 1.7300 3.0410 4.0767 6.1451 14.8492 19.0475 0.0175 0.0822 0.3942 0.0518 0.1448 0.8681 2.5260 14.8779 28.5206 25.8293 25.4324 0.6884 11.4139 2.8827 0.0709 0.0268 1.5354 2.2728 6.2532 0.4085 10.9466 21.1682 1.2304 10.1356 45.7001 2.6545 8.4044 15.5395 4.6949 7.1194 11.6552 34.0730 28.6302 14.9774 0.9295 11.5635 1.5062 4.5585 142.0295 123.8539 7.1588 16.3593 5.6403 4.3029 10.2925 6.9456 7.1430 3.7525 0.1943 0.1424 15.0533 16.7647 0.1070 0.3008 3.7918 1.8596 19.4012 19.1447 15.2281 3.2420 2.3425 2.3806 59.9164 36.9815 10.8964 460.4008 182.8068 7.7194 19.4634 4.6191 0.4147 218.8750 92.2794 115.3951 130.2924 157.3498 56.4629 17.2288 33.1387 34.5125 29.6539 1.8039 1.1447 96.6291 98.7338 1.7418 121.9547 24.3110 39.8903 4.6106 4.5522 59.9655 57.2726 17.6143 15.3520 15.9296 22.7535 27.2135 19.2027 5.0733 4.8124 27.2612 31.0733 15.2272 12.3753
temp: 298.150 k
press: 1.00000 atm
elementType: 7 7 6 6 6 6 6 6 6 6 6 6 6 6 6 6 6 6 6 6 6 6 6 6 6 6 6 6 1 1 1 1 1 1 1 1 1 1 1 1 1 1 1 1 1 1 1 1 1 1 1 1 1 1 1 1 1 1 1 1
symmnumber: 1
zpe: 1340340.1 jmol-1
zpe.correction: 0.510509 hartree
zpe.thermalcorrener: 0.539578 hartree
zpe.thermalcorrenthalpy: 0.540522 hartree
zpe.thermalcorrgfe: 0.446349 hartree
zpe.sumelectzpe: -1117.404489 hartree
zpe.sumelectthermal: -1117.375420 hartree
zpe.sumelectthermalent: -1117.374476 hartree
zpe.sumelectthermalfe: -1117.468649 hartree
dipole: -1.1905 -2.0130 1.2708
dipole: 2.6617
quadrupole: -135.7241 -147.3658 -161.4747
quadrupole: -9.0378 -2.2372 -2.6426
quadrupole: 12.4641 0.8224 -13.2865 -9.0378 -2.2372 -2.6426
hfenergy: -1117.9149979 hartree
pointgroup: C01 [X(C26H32N2)]
dipole: -0.8377223 0.3810747 -0.4995916 debye
polarizability: 347.5987045|12.8826988|355.3744382|3.974749|-0.028138|238.3688652 unknown
InChI: InChI=1S/C26H32N2/c1-19(2)20-7-9-21(10-8-20)26(22-11-15-24(16-12-22)27(3)4)23-13-17-25(18-14-23)28(5)6/h7-19,26H,1-6H3
charge 0 multiplicity 1
60 atoms
N  -4.653034 -3.185268 -0.423495
N  -0.38503 5.570509 -0.657988
C  -0.031513 0.024211 1.111632
C  1.320326 -0.611052 0.734742
C  -1.223755 -0.854748 0.696139
C  -0.163101 1.479805 0.630134
C  3.806413 -1.892593 0.060182
C  5.130474 -2.577301 -0.292633
C  1.838093 -1.667027 1.526057
C  2.066653 -0.204638 -0.399087
C  3.058851 -2.294245 1.196347
C  3.286032 -0.835582 -0.730189
C  -2.44116 -0.775773 1.418536
C  0.507456 2.514714 1.330433
C  -1.187019 -1.732954 -0.413531
C  -0.91007 1.851964 -0.513093
C  -3.534221 -2.420992 -0.060298
C  -0.310648 4.233868 -0.238443
C  5.060157 -3.280609 -1.6747
C  6.321866 -1.583594 -0.241343
C  -3.572189 -1.533111 1.062125
C  0.443245 3.8587 0.919396
C  -2.307518 -2.500602 -0.790826
C  -0.988808 3.191691 -0.944727
C  -5.889656 -3.092546 0.357972
C  -4.577459 -4.092555 -1.572206
C  0.319033 6.615004 0.091822
C  -1.176278 5.923094 -1.84047
H  -0.049647 0.064169 2.221952
H  5.313775 -3.359937 0.471797
H  1.273184 -2.004366 2.404578
H  1.693794 0.6217 -1.014528
H  3.44026 -3.106703 1.828412
H  3.839301 -0.494734 -1.614454
H  -2.508144 -0.098604 2.280229
H  1.101439 2.260897 2.218458
H  -0.25974 -1.833102 -0.989361
H  -1.455749 1.082051 -1.070537
H  4.239913 -4.020319 -1.703401
H  6.009585 -3.803627 -1.895914
H  4.881379 -2.547526 -2.483314
H  6.200693 -0.781858 -0.993505
H  7.274756 -2.104537 -0.452612
H  6.399086 -1.104848 0.751414
H  -4.483118 -1.435072 1.660077
H  0.976033 4.61604 1.501831
H  -2.220371 -3.167362 -1.653872
H  -1.586635 3.423781 -1.8310
H  -5.736239 -3.392416 1.415862
H  -6.648958 -3.762985 -0.07556
H  -6.305196 -2.063281 0.35609
H  -3.802519 -4.875438 -1.433418
H  -4.344183 -3.550826 -2.512466
H  -5.547433 -4.597778 -1.706171
H  1.414465 6.438121 0.11909
H  -0.03746 6.686304 1.140835
H  0.147793 7.59125 -0.389455
H  -0.806447 5.412326 -2.754021
H  -1.114465 7.009489 -2.013526
H  -2.247493 5.65862 -1.7176
