program: Gaussian 09
title: 000239123
version: EM64L-G09RevD.01
frameworkgroup: C1[X(C23H25ClN2O)]
method: RPBEPBE
basis: SDD
operation: Freq
keyword: #p
keyword: freq=noraman
keyword: PBEPBE/SDD
title: #p freq=noraman PBEPBE/SDD
converged: YES YES NO NO
title: Mulliken charges:
elementType: Cl O N N C C C C C C C C C C C C C C C C C C C C C C C H H H H H H H H H H H H H H H H H H H H H H H H H
charge: -0.087126 -0.423750 -0.155211 -0.153183 -0.467202 0.455804 0.347259 0.276111 -0.467898 -0.446561 -0.374540 -0.351711 0.101574 -0.287925 0.401432 0.396621 -0.367742 -0.360254 -0.377657 -0.374254 -0.366070 -0.150906 -0.224501 -0.646969 -0.646867 -0.646673 -0.646000 0.232558 0.229979 0.236126 0.246589 0.257258 0.283678 0.234684 0.237163 0.233472 0.238527 0.251464 0.251896 0.233439 0.214949 0.231352 0.215227 0.233248 0.231267 0.234139 0.217343 0.233979 0.233769 0.235449 0.217199 0.379443
chargesum: 0.00000
title: Mulliken charges with hydrogens summed into heavy atoms:
elementType: Cl O N N C C C C C C C C C C C C C C C C C C C C C C C
charge: -0.087126 -0.044308 -0.155211 -0.153183 -0.234644 0.455804 0.347259 0.276111 -0.237919 -0.210435 -0.127951 -0.094453 0.101574 -0.004247 0.401432 0.396621 -0.133058 -0.123091 -0.144185 -0.135727 -0.114605 -0.150906 0.027395 0.032771 0.032874 0.038789 0.040418
polarizability: 3.71566613e+02 -1.08825346e+00 2.90727674e+02 -5.15824300e+00 -1.30764493e+00 2.18850070e+02
1716.lowfreq: -6.6557 -3.5155 -0.0006 0.0007 0.0013 4.7492 15.6848 25.4062 26.0692
frequency: 14.8926 25.3570 25.9813 34.9395 36.8675 60.5610 77.3794 80.5883 83.5285 89.6507 110.9426 117.6009 128.3296 159.6032 166.2080 178.3593 189.0229 200.3469 202.1356 220.3218 235.2582 256.0421 281.5981 306.2863 333.5766 338.6912 357.5919 368.7545 393.6420 416.9131 417.5925 421.8632 446.7068 469.3490 470.4570 474.7206 515.0739 518.6643 529.8146 538.4748 556.3467 567.7352 621.0962 627.9027 632.9677 644.2240 697.0880 714.3853 729.1493 735.7781 744.5661 791.8078 801.6219 806.9731 813.4149 816.9249 821.5326 831.8753 860.6951 885.2379 902.6896 939.3589 941.8926 943.3644 945.2313 946.8936 955.7809 967.9540 996.4375 998.5207 1057.0511 1057.2463 1073.8525 1087.6866 1109.3960 1110.0632 1110.3244 1110.6817 1128.0460 1131.5906 1154.6147 1165.2464 1165.8216 1174.1962 1187.3532 1196.5916 1212.3869 1218.6640 1239.9646 1257.6599 1262.8277 1264.0516 1269.0017 1295.9360 1327.0365 1335.4255 1358.8793 1361.3524 1372.9885 1385.3667 1390.7439 1412.1966 1424.7832 1426.6123 1437.3235 1439.0011 1458.0679 1458.9956 1462.1355 1463.7199 1464.7871 1474.3837 1475.7344 1493.2333 1493.3508 1505.5785 1506.4504 1524.3582 1528.3588 1558.0937 1565.6686 1575.4828 1615.4550 1630.4840 1633.5898 2932.8185 2937.1529 2937.5594 2941.5150 2945.5238 2996.2945 2998.8510 3002.2419 3005.0174 3092.8276 3094.7023 3102.5357 3105.0000 3110.6978 3114.5681 3124.0765 3130.5774 3157.4033 3159.8488 3162.2552 3163.9294 3165.9676 3167.3205 3177.8032 3388.9668
redmass: 3.4103 6.0806 5.3321 5.1304 3.3155 4.6434 2.4214 2.9606 2.5068 2.4951 2.0582 2.1950 4.7984 5.1962 3.8109 4.0695 5.1364 1.1584 1.1146 2.3957 2.2663 3.6156 4.4300 4.0987 6.2660 4.3445 12.2179 5.0937 3.7190 2.9702 3.0530 3.3489 3.3420 3.5450 3.6520 3.5572 2.5824 2.1576 1.4199 3.0537 3.0458 3.4130 6.5877 7.1982 6.9958 6.1362 4.0501 3.9215 3.8837 4.2610 4.6761 3.6157 2.5940 1.2738 1.3103 1.4688 2.2642 2.4570 4.1794 3.3672 1.6044 1.3520 1.7717 1.8906 2.9658 1.5332 1.3652 1.3374 3.0916 2.9786 1.4877 1.4868 1.9643 2.3420 1.3191 1.2438 1.2392 1.3153 1.5054 1.4787 1.7747 1.7316 1.6891 1.7954 1.6701 1.2540 1.2875 1.6125 1.9270 1.7803 2.7570 2.7246 1.5681 1.6499 1.4131 1.4653 3.3209 3.1770 5.5592 4.2512 4.0262 3.4712 1.9137 1.7151 1.5239 1.6964 1.2105 1.2186 3.0347 1.0403 1.0417 1.0463 1.0459 1.0839 1.0863 1.1412 1.1187 2.4242 2.5154 6.5250 6.5031 7.1657 6.9747 6.0544 6.2322 1.0371 1.0432 1.0745 1.0398 1.0395 1.0989 1.1030 1.0992 1.1029 1.0956 1.0960 1.0936 1.0939 1.0894 1.0893 1.0887 1.0879 1.0883 1.0927 1.0924 1.0938 1.0934 1.0917 1.0976 1.0659
irintensity: 0.1995 0.6996 0.5625 0.6676 0.3427 0.3048 0.1282 3.8592 0.5940 5.3958 0.4396 0.1604 0.7255 0.1196 1.2261 0.9051 0.0328 0.1022 0.0370 1.5953 2.1709 0.9832 1.3309 0.3788 2.3559 3.8949 2.2911 4.2259 1.1684 0.2895 0.9430 1.7037 2.9553 2.0290 17.4597 4.5419 10.6581 29.1309 37.9732 19.4386 27.7436 27.2677 28.2979 10.4131 0.2616 11.8463 2.8115 1.4087 8.4708 6.5114 6.7873 19.3404 19.9334 0.5991 6.6053 39.6274 40.2815 38.9874 15.4146 15.9137 10.6902 0.2509 7.3870 11.0367 21.8406 3.3378 0.5317 0.2265 1.2422 1.6414 17.2531 34.9615 10.9823 17.0253 1.1511 0.0525 0.0155 0.7753 1.2304 6.9198 0.1978 33.8669 13.8001 140.8071 20.3205 46.1869 14.7214 11.8263 8.1792 9.3026 35.8828 35.2240 35.9132 26.8316 19.3944 0.7836 140.0602 123.9652 16.1170 6.7260 16.1664 17.6958 6.0921 3.3096 0.5489 0.4708 23.7600 21.0920 161.4219 0.0411 0.4527 19.9576 21.5576 2.6519 1.3270 17.4830 23.1099 440.2924 180.4228 6.2698 11.5391 9.2486 22.2454 248.2597 125.6796 114.0870 75.0395 50.8838 102.8190 95.7230 0.1408 92.3231 2.9963 84.4740 4.3020 4.3653 55.9662 51.4419 13.6898 10.6503 10.3178 8.4473 2.8259 24.3834 21.4078 13.0152 14.4982 0.6298 8.7304 414.8277
temp: 298.150 k
press: 1.00000 atm
elementType: 17 8 7 7 6 6 6 6 6 6 6 6 6 6 6 6 6 6 6 6 6 6 6 6 6 6 6 1 1 1 1 1 1 1 1 1 1 1 1 1 1 1 1 1 1 1 1 1 1 1 1 1
symmnumber: 1
zpe: 1108032.0 jmol-1
zpe.correction: 0.422027 hartree
zpe.thermalcorrener: 0.448827 hartree
zpe.thermalcorrenthalpy: 0.449771 hartree
zpe.thermalcorrgfe: 0.362191 hartree
zpe.sumelectzpe: -1534.266645 hartree
zpe.sumelectthermal: -1534.239845 hartree
zpe.sumelectthermalent: -1534.238901 hartree
zpe.sumelectthermalfe: -1534.326481 hartree
dipole: 2.6555 -6.2627 0.9296
dipole: 6.8656
quadrupole: -128.7911 -162.3012 -162.0786
quadrupole: 7.8394 9.5565 -1.8932
quadrupole: 22.2659 -11.2442 -11.0216 7.8394 9.5565 -1.8932
hfenergy: -1534.688672 hartree
pointgroup: C01 [X(C23H25Cl1N2O1)]
dipole: 0.586495 2.6266515 -0.2300639 debye
polarizability: 368.2493121|15.0611362|293.6230042|8.8988261|3.4913181|219.2720407 unknown
InChI: InChI=1S/C23H25ClN2O/c1-25(2)19-10-5-16(6-11-19)23(21-15-18(24)9-14-22(21)27)17-7-12-20(13-8-17)26(3)4/h5-15,23,27H,1-4H3
charge 0 multiplicity 1
52 atoms
Cl -2.535993 -4.443283 -1.830171
O  2.08935 -2.561225 1.541122
N  -4.803454 2.447501 -0.271386
N  4.813208 2.378657 -0.517596
C  0.015564 -0.591577 0.941375
C  -1.233194 0.237627 0.61178
C  1.321121 0.131391 0.559916
C  -0.038849 -2.031305 0.392865
C  -2.352037 0.211876 1.48095
C  1.889385 1.08742 1.44268
C  -1.341615 1.022227 -0.562372
C  1.957583 -0.048937 -0.696622
C  0.994042 -2.94991 0.753107
C  -1.106595 -2.507338 -0.40276
C  -3.639346 1.723721 0.015951
C  3.674883 1.64667 -0.166919
C  -3.529231 0.931822 1.20327
C  3.035308 1.827738 1.102502
C  -2.509221 1.749346 -0.862153
C  3.103947 0.682063 -1.058487
C  0.937537 -4.304467 0.361343
C  -1.139444 -3.856836 -0.79864
C  -0.139718 -4.772408 -0.421247
C  -5.946147 2.393023 0.646592
C  -4.891555 3.235019 -1.505527
C  5.37182 3.361229 0.418608
C  5.446689 2.170843 -1.825186
H  0.031696 -0.698267 2.049152
H  -2.305484 -0.391207 2.397317
H  1.414539 1.262981 2.416706
H  -0.491968 1.080753 -1.25197
H  1.55253 -0.786147 -1.40056
H  -1.910236 -1.824123 -0.690109
H  -4.361142 0.876728 1.911076
H  3.432116 2.546616 1.824716
H  -2.53696 2.343214 -1.780241
H  3.558307 0.496366 -2.035748
H  1.74328 -4.976469 0.670679
H  -0.192135 -5.819963 -0.73111
H  -6.341345 1.361741 0.757421
H  -6.759275 3.026435 0.257876
H  -5.681014 2.764584 1.65797
H  -5.8766 3.725401 -1.558563
H  -4.777834 2.602493 -2.410416
H  -4.115569 4.027155 -1.546194
H  4.643093 4.162218 0.65994
H  6.257214 3.835574 -0.033079
H  5.68793 2.890034 1.371868
H  4.755098 2.40435 -2.660665
H  5.794849 1.125501 -1.954003
H  6.32253 2.832222 -1.917323
H  2.215641 -1.572075 1.482267
