program: Gaussian 09
title: 000239073
version: EM64L-G09RevD.01
frameworkgroup: C1[X(C8H12N2O2S)]
method: RPBEPBE
basis: SDD
operation: Freq
keyword: #p
keyword: freq=noraman
keyword: PBEPBE/SDD
title: #p freq=noraman PBEPBE/SDD
converged: YES YES NO NO
title: Mulliken charges:
elementType: S O O N N C C C C C C C C H H H H H H H H H H H H
charge: 0.923498 -0.576245 -0.523574 -0.711184 -0.701471 -0.445489 0.562337 0.554228 0.549214 -0.618589 -0.652305 -0.831190 -0.811862 0.243234 0.231582 0.275406 0.275178 0.220992 0.224408 0.233509 0.235670 0.308695 0.378661 0.320512 0.334783
chargesum: 0.00000
title: Mulliken charges with hydrogens summed into heavy atoms:
elementType: S O O N N C C C C C C C C
charge: 0.923498 -0.576245 -0.523574 -0.023828 -0.046176 -0.445489 0.562337 0.554228 0.549214 -0.375355 -0.420723 -0.059612 -0.118275
polarizability: 1.76401390e+02 1.59622229e+00 1.50325817e+02 -8.66082121e-01 1.07770316e+00 8.31115904e+01
1716.lowfreq: -8.7457 -4.4209 -0.0016 0.0003 0.0012 4.6335 50.7368 54.2048 70.1814
frequency: 50.7215 54.1831 70.1701 145.7041 159.5120 187.8877 196.3924 214.8958 227.6183 228.5429 259.0571 287.9528 296.1544 314.9384 347.0192 359.2818 434.2008 451.7217 479.9385 508.9417 536.1299 545.1984 555.1079 586.2511 592.9181 717.1038 752.3339 781.0520 815.0331 848.2384 862.6434 893.7203 948.8879 957.4357 976.5532 1027.9301 1047.7497 1058.6945 1062.2458 1070.7271 1112.9110 1189.3801 1272.4110 1351.0121 1380.7666 1396.6124 1405.6456 1431.4968 1451.2194 1460.6657 1467.8133 1490.8307 1491.9149 1533.4028 1579.0127 1613.0980 1633.4178 2980.3900 2990.6581 3060.1569 3075.4796 3089.0516 3102.2554 3123.2526 3135.1597 3328.8638 3349.7865 3514.7442 3644.5536
redmass: 1.1872 3.8019 3.6249 2.0856 1.5082 3.3919 2.5407 2.4269 2.6779 4.1137 6.0648 3.0362 3.1978 5.3661 3.9520 4.3589 6.5763 1.2183 4.6765 3.6393 3.8856 3.4286 5.0710 4.6609 3.5821 1.9801 1.3242 11.3184 1.4679 1.3987 1.5008 5.0952 3.6179 2.0875 4.4862 1.5906 1.5752 1.5263 1.5208 1.9717 1.6249 1.4335 1.4839 4.6350 3.9095 1.2992 1.2178 2.5132 1.8799 1.0636 1.0454 1.4739 1.2789 1.0986 4.5369 2.1023 1.9851 1.0372 1.0367 1.0974 1.0968 1.0991 1.1001 1.0911 1.0918 1.0618 1.0417 1.0994 1.0897
irintensity: 0.5862 4.5262 0.7973 17.0791 3.4665 1.3265 1.6501 8.8977 8.1179 0.9510 1.4455 5.6978 7.4770 7.6782 4.1865 19.3405 83.9355 153.4809 79.3259 2.2983 6.1788 10.4919 29.5176 15.7360 8.9484 45.1699 84.3904 100.5994 98.6250 31.5800 8.2211 93.9410 3.8965 0.3064 5.0805 1.4918 9.6859 18.0300 28.0461 25.5972 1.5904 3.0563 9.8863 33.2723 16.9532 14.6732 22.5203 21.8145 13.6662 17.3213 12.4646 16.6617 71.4163 21.9033 49.4625 36.0314 356.0375 28.0915 15.6943 16.9641 2.3498 19.4663 14.9420 17.9555 8.7775 181.8566 15.0458 19.0459 58.9231
temp: 298.150 k
press: 1.00000 atm
elementType: 16 8 8 7 7 6 6 6 6 6 6 6 6 1 1 1 1 1 1 1 1 1 1 1 1
symmnumber: 1
zpe: 505821.5 jmol-1
zpe.correction: 0.192657 hartree
zpe.thermalcorrener: 0.207251 hartree
zpe.thermalcorrenthalpy: 0.208195 hartree
zpe.thermalcorrgfe: 0.151786 hartree
zpe.sumelectzpe: -968.915803 hartree
zpe.sumelectthermal: -968.901209 hartree
zpe.sumelectthermalent: -968.900265 hartree
zpe.sumelectthermalfe: -968.956675 hartree
dipole: 3.5189 0.6825 2.9458
dipole: 4.6397
quadrupole: -80.5512 -77.6522 -89.2330
quadrupole: 4.5738 -10.5424 -0.3321
quadrupole: 1.9276 4.8266 -6.7542 4.5738 -10.5424 -0.3321
hfenergy: -969.1084605 hartree
pointgroup: C01 [X(C8H12N2O2S1)]
dipole: -1.3992785 -0.3609033 1.1152693 debye
dipolederiv: 1.9849468 0.1755431 0.1998213 0.1337016 1.2850977 0.0723764 0.2466034 0.0829788 1.5340292 -0.7386877 0.0536345 -0.0040446 0.0017445 -0.8147898 -0.1486179 -0.0543545 0.0144189 -0.5398106 -0.7475855 -0.0864163 0.0470248 -0.1064881 -0.5579037 0.122532 0.002283 0.0475777 -0.5677584 -0.4735293 0.4447565 0.0086231 0.3464798 -1.1920893 -0.0353801 0.0098579 0.0049373 -0.6365721 -0.6764058 -0.0298699 -0.1388348 -0.0755396 -0.4864076 -0.1386174 -0.179829 -0.2257741 -0.7659964 -0.291925 -0.2645 -0.0121537 0.2429941 -0.4936979 0.0037839 0.0578302 0.0098803 -0.3044317 0.3736857 0.2857498 0.0097443 -0.3893781 0.2489671 -0.0038986 -0.0097468 -0.0009767 0.0741661 0.2281458 -0.6591353 -0.0374162 -0.064437 1.1578 0.0719325 0.0018381 0.0628467 0.1715537 0.5665344 -0.0499158 -0.0029231 0.1723534 0.4977865 0.0257873 0.0137879 0.0207672 0.0402764 -0.6172729 -0.3324328 -0.0223713 -0.1505452 -0.2488584 0.0014503 -0.0139542 0.0018356 -0.257565 -0.3095989 0.5458618 0.0262463 -0.008487 -0.248077 -0.0053695 -0.009693 -0.0055492 -0.2440384 -0.0833179 -0.1692547 -0.0253326 -0.1022145 -0.0937968 0.0125484 -0.0024666 0.0229734 -0.0280878 -0.1960375 0.0154308 -0.0010303 0.1088541 0.0782265 0.0021024 -0.0007684 0.0033282 0.049434 0.0057443 0.0634179 0.0012962 0.0814739 -0.0592337 -0.0106638 0.0054006 -0.0114291 0.1599946 -0.0119804 -0.064427 -0.0037772 -0.0877885 -0.0786814 -0.0124236 -0.0028098 -0.012861 0.1647634 0.0606122 -0.0513649 -0.0716917 -0.032633 0.0819894 0.0195859 -0.0759133 -0.0226614 0.0134596 0.0816373 -0.0599663 0.0824512 -0.0317829 0.0828126 -0.0260028 0.0686401 0.0256072 0.0150236 -0.0251204 0.1890128 0.0132025 0.0673128 -0.0423086 -0.0135249 0.0067844 -0.0247329 0.1161242 0.0266678 -0.0275463 -0.0005272 -0.150995 -0.1090116 -0.006936 -0.0035419 -0.0077982 0.1073513 0.001788 0.0143549 0.0358572 0.0327027 0.0514197 -0.102268 0.1017662 -0.0870199 -0.042337 -0.0006738 0.0184852 -0.0367612 0.039242 0.0392829 0.1059031 -0.0968908 0.0910633 -0.0264536 0.107698 -0.0651413 -0.0046441 -0.0488924 0.2466528 -0.0078747 -0.0002371 -0.0211449 0.3611298 0.4280791 0.1247489 0.029308 0.0512312 0.2964998 0.0069359 0.0062409 -0.0107564 0.3386889 0.2125177 -0.0249011 -0.1083057 -0.0211664 0.0777815 0.0235497 -0.0280557 0.0369316 0.164025 0.0940779 -0.0461245 0.0162387 -0.0077423 0.2805393 0.0430893 -0.0427718 0.0055577 0.1030312 unknown
polarizability: 176.2547123|2.0391678|150.3160548|2.7164035|2.6905479|83.26803 unknown
InChI: InChI=1S/C8H12N2O2S/c1-5-3-6(2)8(7(9)4-5)13(10,11)12/h3-4H,9-10H2,1-2H3
charge 0 multiplicity 1
25 atoms
S  2.160767 -0.086309 -0.057528
O  2.7016 -1.640439 -0.119492
O  2.774222 0.978668 -1.120319
N  0.18378 -2.578104 -0.139676
N  2.631248 0.623754 1.586059
C  0.281089 -0.091549 -0.010277
C  -0.374712 1.174081 0.048686
C  -0.423166 -1.341091 -0.066753
C  -2.533554 -0.036505 0.012111
C  -1.783988 1.172264 0.061078
C  -1.854153 -1.260193 -0.05198
C  0.367808 2.496291 0.101304
C  -4.050269 0.010241 0.022356
H  -2.308842 2.132864 0.109838
H  -2.419322 -2.199526 -0.094778
H  1.062294 2.522511 0.960357
H  0.975639 2.65221 -0.806959
H  -0.34849 3.327837 0.198474
H  -4.492421 -0.999771 -0.009211
H  -4.424949 0.518071 0.930624
H  -4.434019 0.57665 -0.846701
H  -0.39308 -3.412538 -0.20165
H  1.212124 -2.635554 -0.183967
H  2.664842 -0.141517 2.281562
H  3.551152 1.080356 1.454542
