program: Gaussian 09
title: 000239047
version: EM64L-G09RevD.01
frameworkgroup: C1[X(C13H19Cl2NO)]
method: RPBEPBE
basis: SDD
operation: Freq
keyword: #p
keyword: freq=noraman
keyword: PBEPBE/SDD
title: #p freq=noraman PBEPBE/SDD
converged: NO YES NO NO
title: Mulliken charges:
elementType: Cl Cl O N C C C C C C C C C C C C C H H H H H H H H H H H H H H H H H H H
charge: -0.084366 -0.082686 -0.268087 -0.153381 -0.406666 -0.407874 0.423571 -0.348674 -0.348465 -0.359035 -0.331717 -0.637270 -0.637050 -0.380367 -0.385935 0.321695 -0.536540 0.245538 0.241082 0.246712 0.240817 0.300146 0.300043 0.235771 0.239968 0.224626 0.233675 0.244494 0.224145 0.232853 0.244936 0.239304 0.249298 0.243827 0.217875 0.217739
chargesum: 0.00000
title: Mulliken charges with hydrogens summed into heavy atoms:
elementType: Cl Cl O N C C C C C C C C C C C C C
charge: -0.084366 -0.082686 -0.268087 -0.153381 0.079953 0.079654 0.423571 -0.048527 -0.048422 -0.123264 -0.091749 0.065525 0.064883 -0.141063 -0.136637 0.321695 0.142901
polarizability: 2.30109642e+02 1.09913124e+00 1.85975654e+02 3.77663594e+00 2.36517429e+01 1.20271882e+02
1716.lowfreq: -9.3149 0.0000 0.0016 0.0026 6.3677 7.8987 33.2526 35.3056 39.2377
frequency: 33.2104 35.1727 39.2358 42.3689 50.8322 77.2139 94.9659 141.6872 175.6004 184.2334 195.7915 228.3352 235.4729 243.5940 257.6377 272.5026 300.4099 320.5124 326.6429 342.5360 371.6992 408.8391 419.1235 435.8512 472.2977 507.2716 522.4013 534.3183 606.1462 633.2995 656.3593 682.6563 715.7790 786.2571 791.1213 815.8410 863.5279 867.3013 906.0394 908.2167 923.0661 942.3857 980.5879 984.8272 1001.5333 1005.0028 1006.2003 1075.7035 1113.3306 1124.5036 1133.0294 1136.5468 1141.2722 1160.9893 1188.5133 1193.0167 1203.7485 1221.2367 1234.9923 1246.5579 1270.8725 1320.0138 1335.3924 1342.6551 1346.3723 1353.1023 1374.0152 1380.5462 1387.1033 1389.8948 1433.3037 1438.0240 1462.3695 1462.5066 1465.7027 1470.2592 1472.7606 1474.5196 1477.0190 1495.9290 1509.0930 1575.5736 1635.6455 2952.2068 2985.8400 2986.7321 3000.1808 3005.5138 3036.5662 3061.6732 3067.1828 3075.3150 3077.6569 3089.1029 3089.6202 3107.3824 3108.5657 3121.6373 3144.8463 3149.1058 3165.2913 3171.5697
redmass: 7.3440 6.2066 4.7705 4.0210 4.1399 3.5091 3.5551 4.3527 3.9129 3.7050 9.8201 1.4227 1.3400 1.1334 2.2974 1.9184 3.4706 3.1553 4.0174 4.4452 4.2749 2.9547 3.4189 2.3058 2.7262 2.8825 2.7115 3.5675 4.3705 6.4635 3.7947 4.0732 3.7668 4.9835 1.3851 1.5711 2.9083 2.6672 1.3694 1.3659 1.4766 1.3322 3.2438 5.2443 1.4851 2.6010 1.5328 1.7817 1.2606 1.6769 2.2428 2.0910 2.1995 1.3537 1.4850 1.5937 1.3578 1.5720 1.7509 1.7722 1.3786 1.3696 1.2484 1.4646 1.4442 1.3707 4.5922 1.6820 1.2476 1.2423 2.8606 1.2324 1.0532 1.0481 1.0501 1.0567 1.0614 1.0797 1.0726 1.0947 2.4250 7.0405 6.4137 1.0334 1.0365 1.0365 1.0617 1.0627 1.1036 1.0987 1.0946 1.0971 1.0990 1.0937 1.0937 1.0991 1.0986 1.0987 1.0865 1.0869 1.0950 1.0962
irintensity: 2.0417 0.1150 0.4053 0.5185 1.8214 3.4193 2.0135 1.0984 0.8539 2.5495 0.8805 2.8523 4.4545 1.5013 10.8310 1.2659 4.7752 0.1973 1.3292 6.4924 1.5212 2.3273 1.8441 6.6076 7.5474 19.4690 10.8838 32.3437 7.3603 6.5445 51.6362 38.2014 0.7929 6.6590 21.4891 71.4789 13.0284 2.5393 8.2001 1.5002 12.1451 0.4440 2.4922 23.3093 46.2880 83.1552 8.2335 84.8659 0.1595 4.4362 2.2708 3.7560 0.3279 1.2379 62.2457 15.2996 75.9018 62.2671 164.0943 15.1179 13.1617 3.8176 4.4226 16.1887 52.2540 9.2805 7.5943 13.0189 24.6151 23.7487 11.9785 15.5555 25.7108 4.9748 12.8671 0.6020 13.4895 66.5946 19.9985 5.2738 426.4635 2.7291 9.7180 78.4434 10.6056 12.7393 36.5294 14.9027 54.4048 3.9116 9.7584 10.4061 1.3712 19.4204 35.1553 34.5877 20.6748 29.2681 18.1325 13.6800 19.6334 2.5574
temp: 298.150 k
press: 1.00000 atm
elementType: 17 17 8 7 6 6 6 6 6 6 6 6 6 6 6 6 6 1 1 1 1 1 1 1 1 1 1 1 1 1 1 1 1 1 1 1
symmnumber: 1
zpe: 776304.7 jmol-1
zpe.correction: 0.295679 hartree
zpe.thermalcorrener: 0.314646 hartree
zpe.thermalcorrenthalpy: 0.315590 hartree
zpe.thermalcorrgfe: 0.246279 hartree
zpe.sumelectzpe: -1555.550827 hartree
zpe.sumelectthermal: -1555.531860 hartree
zpe.sumelectthermalent: -1555.530916 hartree
zpe.sumelectthermalfe: -1555.600226 hartree
dipole: 1.1478 1.1865 0.6602
dipole: 1.7779
quadrupole: -109.9945 -135.0787 -115.2531
quadrupole: 5.0093 3.6568 -3.4058
quadrupole: 10.1143 -14.9700 4.8557 5.0093 3.6568 -3.4058
hfenergy: -1555.8465057 hartree
pointgroup: C01 [X(C13H19Cl2N1O1)]
dipole: -0.4178338 -0.4306087 0.3595391 debye
polarizability: 229.7053665|2.5196734|174.3286634|-4.6905882|-34.8662757|132.3231486 unknown
InChI: InChI=1S/C13H19Cl2NO/c1-10(14)8-16(9-11(2)15)12-4-6-13(17-3)7-5-12/h4-7,10-11H,8-9H2,1-3H3
charge 0 multiplicity 1
36 atoms
Cl 2.368012 -3.785234 1.187199
Cl 2.973906 3.515112 -1.07528
O  -4.577839 0.493956 -0.202044
N  1.093015 -0.017249 0.016062
C  1.747812 -1.101126 0.764544
C  1.934555 0.960828 -0.69146
C  -0.324314 0.084445 -0.019017
C  1.733898 -2.435838 -0.022054
C  2.06675 2.290678 0.092304
C  -1.155645 -0.819976 0.702142
C  -0.977785 1.102015 -0.783386
C  2.607832 -2.453962 -1.273874
C  2.848962 2.194306 1.400115
C  -2.564328 -0.716748 0.671248
C  -2.378245 1.201877 -0.819673
C  -3.187307 0.29665 -0.092802
C  -5.439847 -0.422137 0.543632
H  1.266864 -1.251043 1.749216
H  2.797203 -0.822605 0.964648
H  1.537138 1.170617 -1.701948
H  2.944243 0.536702 -0.831624
H  0.702187 -2.753049 -0.240113
H  1.082604 2.762154 0.240174
H  -0.71927 -1.622611 1.303728
H  -0.399557 1.827304 -1.362703
H  3.661108 -2.232318 -1.026701
H  2.240668 -1.693277 -1.988527
H  2.566531 -3.437473 -1.770209
H  3.870547 1.812589 1.226215
H  2.323918 1.508992 2.092266
H  2.924659 3.180076 1.887859
H  -3.154679 -1.437249 1.245648
H  -2.865184 1.98459 -1.409598
H  -6.467392 -0.096293 0.324277
H  -5.253575 -0.35651 1.634152
H  -5.302839 -1.469893 0.209385
