program: Gaussian 09
title: 000239053
version: EM64L-G09RevD.01
frameworkgroup: C1[X(C15H20N2O3)]
method: RPBEPBE
basis: SDD
operation: Freq
keyword: #p
keyword: freq=noraman
keyword: PBEPBE/SDD
title: #p freq=noraman PBEPBE/SDD
converged: YES YES NO NO
title: Mulliken charges:
elementType: O O O N N C C C C C C C C C C C C C C C H H H H H H H H H H H H H H H H H H H H
charge: -0.192582 -0.214517 -0.199967 -0.469199 -0.335908 0.101367 -0.457055 -0.473861 -0.429729 -0.417106 -0.387799 0.381232 0.172016 -0.363998 -0.430460 -0.254480 -0.244886 -0.244945 0.298806 -0.494449 0.209264 0.218604 0.197851 0.198677 0.190634 0.260302 0.232170 0.195913 0.207482 0.182681 0.249825 0.256957 0.328768 0.229885 0.228266 0.232765 0.320071 0.230601 0.273253 0.213550
chargesum: 0.00000
title: Mulliken charges with hydrogens summed into heavy atoms:
elementType: O O O N N C C C C C C C C C C C C C C C
charge: -0.192582 -0.214517 -0.199967 -0.140431 -0.015836 0.101367 -0.029187 -0.077333 0.021207 0.010977 0.002364 0.381232 0.172016 -0.114173 -0.173502 -0.024595 -0.016620 -0.012180 0.298806 0.222954
polarizability: 1.82829106e+02 5.15830135e-02 2.10158673e+02 6.16069914e+00 -4.29535807e+00 1.54471869e+02
1716.lowfreq: -3.8063 -0.0007 -0.0005 -0.0002 6.9550 12.6949 20.2271 25.0597 34.3236
frequency: 18.6531 24.9925 34.1745 47.4998 71.7626 93.2100 108.5114 125.1077 131.9974 142.3677 193.5481 195.8534 220.1681 242.9200 277.0981 280.3751 284.6440 327.6035 345.9150 362.2263 383.9701 401.7726 407.3094 453.7837 476.3829 482.3549 519.1419 541.6568 564.2305 616.5600 635.7439 668.3260 685.2123 707.6280 717.0300 764.4664 782.0682 799.0332 834.2841 845.1313 857.7710 869.3984 902.3132 911.7151 921.4188 932.5975 937.0934 957.5692 981.8193 990.1425 998.7581 1005.3096 1025.5382 1034.4391 1060.7901 1071.1116 1091.4264 1105.0869 1106.2373 1126.2350 1146.7746 1157.7590 1165.0762 1174.2535 1190.4458 1196.5232 1200.7692 1206.2701 1261.3084 1277.0011 1282.7519 1317.9168 1328.2686 1340.0052 1343.6155 1345.6240 1358.5709 1376.4940 1397.1225 1415.0789 1419.5011 1433.2142 1439.7858 1452.2890 1462.7432 1466.6180 1473.1755 1479.9145 1480.4229 1482.8824 1586.2526 1608.0494 1625.8554 1674.5963 2961.0070 2968.3144 2979.2952 2980.4834 2984.2829 2995.5865 3025.9656 3032.1041 3041.9525 3050.8589 3070.9795 3098.5529 3120.2207 3128.1938 3133.2183 3141.2925 3156.0158 3167.3343 3499.1486 3528.8019
redmass: 6.4975 4.9235 3.8883 4.2739 4.4423 4.7476 4.1167 3.1994 4.0421 3.6521 1.3777 3.0227 4.2768 2.7918 2.8605 4.6002 3.3333 3.1118 1.6186 3.0428 2.6899 2.9274 3.0386 3.7629 3.3601 3.3863 1.9569 2.2776 1.2966 6.3442 5.1628 6.1343 5.9916 2.0235 4.0848 2.0930 1.5700 2.1065 3.6048 4.1024 1.2799 2.6813 2.4665 2.4964 1.8401 1.5833 2.1676 4.9966 1.4191 5.6124 1.3145 3.1755 5.3125 2.2441 1.9210 1.7741 1.4726 1.6223 1.2590 2.2895 1.8638 1.5625 2.0581 1.0560 2.6921 1.8438 1.4325 2.0794 1.3447 1.2149 1.4470 1.3202 1.3845 1.4021 1.3721 1.4452 1.4315 5.6175 1.3587 1.5295 1.4935 2.2211 1.0596 1.0973 1.0945 1.0827 1.0967 1.0551 1.0934 2.0434 5.8361 5.8986 6.2543 10.0782 1.0643 1.0594 1.0629 1.0630 1.0299 1.0651 1.1000 1.0952 1.1037 1.0976 1.0997 1.1033 1.0860 1.0872 1.1054 1.0931 1.0947 1.0993 1.0767 1.0805
irintensity: 5.2281 2.6169 0.6576 0.6262 1.5877 7.0597 6.6191 7.0272 2.3401 0.3847 4.3806 4.0771 6.1920 3.9774 22.6566 0.2022 1.2546 3.7170 55.4196 1.3165 18.2040 0.5869 0.4625 0.1242 4.4958 6.6534 4.5953 51.3730 87.4426 0.0648 12.3179 14.1160 13.4672 64.0129 7.9626 32.3076 1.3283 2.5818 4.3030 9.7480 0.1235 31.1946 10.0898 4.0449 10.6484 2.9822 10.4245 5.3824 0.0859 0.3795 0.4327 6.7248 32.0893 14.0092 1.3717 8.4186 8.6483 11.8438 11.9433 190.5765 4.2102 32.9062 84.4328 0.2378 27.7939 11.3821 5.4584 4.8068 2.1169 2.7243 0.4647 0.8317 1.3350 1.1127 3.4646 1.8962 1.3726 0.0155 57.5745 259.1443 374.6247 11.0138 28.0898 5.8974 8.3701 9.7497 23.3920 11.9115 11.8120 23.4893 5.7119 16.4938 52.3585 266.2355 41.7354 26.3862 38.1154 15.0062 51.6736 58.5142 49.2652 63.6946 47.7309 14.2831 35.5726 24.5744 4.2164 0.8522 13.4422 20.8842 30.4479 15.0171 17.5818 25.9164
temp: 298.150 k
press: 1.00000 atm
elementType: 8 8 8 7 7 6 6 6 6 6 6 6 6 6 6 6 6 6 6 6 1 1 1 1 1 1 1 1 1 1 1 1 1 1 1 1 1 1 1 1
symmnumber: 1
zpe: 863297.2 jmol-1
zpe.correction: 0.328813 hartree
zpe.thermalcorrener: 0.348542 hartree
zpe.thermalcorrenthalpy: 0.349487 hartree
zpe.thermalcorrgfe: 0.278651 hartree
zpe.sumelectzpe: -917.224352 hartree
zpe.sumelectthermal: -917.204622 hartree
zpe.sumelectthermalent: -917.203678 hartree
zpe.sumelectthermalfe: -917.274513 hartree
dipole: -1.4591 4.9248 -1.2366
dipole: 5.2831
quadrupole: -113.9267 -116.5153 -117.5277
quadrupole: 10.1514 8.2918 3.6003
quadrupole: 2.0631 -0.5254 -1.5378 10.1514 8.2918 3.6003
hfenergy: -917.5531642 hartree
pointgroup: C01 [X(C15H20N2O3)]
dipole: -0.4963353 -1.9429356 0.5468129 debye
polarizability: 182.9783891|-1.3472595|209.7449292|-5.6979938|-6.3874781|154.7363304 unknown
InChI: InChI=1S/C15H20N2O3/c1-20-17-14(19)16-13(18)15(10-6-3-7-11-15)12-8-4-2-5-9-12/h2,4-5,8-9,16-17H,3,6-7,10-11H2,1H3
charge 0 multiplicity 1
40 atoms
O  0.369578 1.373914 -1.422416
O  2.936632 1.775193 0.198745
O  4.742146 -0.309826 0.928383
N  1.151831 0.203179 0.442647
N  3.363737 -0.49303 0.589476
C  -1.307542 0.330204 0.110331
C  -2.376845 0.838951 -0.912903
C  -1.564042 1.021739 1.487977
C  -2.505021 2.380828 -0.984917
C  -1.597638 2.56312 1.382739
C  -2.708009 3.017265 0.408403
C  -1.376345 -1.21543 0.195771
C  0.126643 0.708341 -0.386097
C  -1.077456 -1.981963 -0.965884
C  -1.733788 -1.911194 1.379423
C  -1.140343 -3.390247 -0.947194
C  -1.799212 -3.325284 1.400714
C  -1.504397 -4.071504 0.23934
C  2.532518 0.604333 0.388063
C  5.53342 0.067488 -0.281195
H  -3.347971 0.397527 -0.609723
H  -2.13961 0.445647 -1.91807
H  -0.80784 0.708181 2.234452
H  -2.550194 0.679343 1.862836
H  -3.356195 2.634542 -1.646666
H  -1.593412 2.793273 -1.451463
H  -0.616625 2.943925 1.035308
H  -1.76805 2.991624 2.389078
H  -2.714998 4.120592 0.322843
H  -3.695777 2.718364 0.818638
H  -0.787508 -1.468101 -1.890794
H  -1.974332 -1.35987 2.293426
H  0.879254 -0.489614 1.146683
H  -0.90724 -3.957405 -1.855494
H  -2.083353 -3.839984 2.325754
H  -1.557101 -5.165726 0.255674
H  3.048889 -1.465487 0.623219
H  6.562816 0.156964 0.099499
H  5.173298 1.032057 -0.673808
H  5.46888 -0.724626 -1.0499
