program: Gaussian 09
title: 000239051
version: EM64L-G09RevD.01
frameworkgroup: C1[X(C10H12N6O2)]
method: RPBEPBE
basis: SDD
operation: Freq
keyword: #p
keyword: freq=noraman
keyword: PBEPBE/SDD
title: #p freq=noraman PBEPBE/SDD
converged: YES YES NO NO
title: Mulliken charges:
elementType: O O N N N N N N C C C C C C C C C C H H H H H H H H H H H H
charge: -0.282930 -0.181242 -0.147385 -0.371304 -0.004807 -0.098076 -0.042807 0.076344 0.323242 -0.034818 -0.052703 -0.205691 -0.624475 0.278611 0.240270 -0.457394 -0.769937 -0.766581 0.381170 0.265239 0.305195 0.244834 0.225411 0.248539 0.238524 0.253291 0.230302 0.251371 0.222644 0.255163
chargesum: 0.00000
title: Mulliken charges with hydrogens summed into heavy atoms:
elementType: O O N N N N N N C C C C C C C C C C
charge: -0.282930 -0.181242 -0.147385 0.009866 -0.004807 -0.098076 -0.042807 0.076344 0.323242 -0.034818 -0.052703 0.059548 0.150966 0.278611 0.240270 -0.208855 -0.047820 -0.037403
polarizability: 2.58521729e+02 -6.78147775e-02 1.85845968e+02 -8.15716861e+00 2.48401645e+00 9.23959600e+01
1716.lowfreq: -4.3872 0.0005 0.0008 0.0008 3.6273 4.7712 25.2786 45.0598 51.4412
frequency: 25.2764 45.0559 51.4399 57.5377 73.9378 94.9673 116.4594 124.0514 165.7764 169.1319 210.1600 218.4117 239.3876 261.3769 270.5410 301.0638 316.2705 371.8582 410.0925 463.0812 528.6303 542.2898 555.4840 557.1758 619.4403 626.9208 631.1954 668.1294 704.5312 726.2306 744.8317 769.9152 778.2621 799.4749 818.8212 862.7485 910.9744 954.8308 967.8884 991.8654 1022.0196 1038.3458 1045.5266 1048.2005 1074.8061 1134.7330 1154.3911 1179.0273 1197.2599 1252.4807 1272.3988 1288.9440 1309.7845 1334.4722 1344.1303 1366.4857 1392.9948 1395.7599 1400.0505 1414.8686 1433.1689 1451.6331 1453.8005 1456.8997 1458.9797 1464.1023 1466.9188 1501.4896 1520.9828 1529.1733 1563.4882 1598.7572 2991.0232 2992.1446 2995.7454 3075.3500 3081.8072 3086.5800 3109.6236 3109.8661 3117.2502 3174.3385 3239.8047 3329.1129
redmass: 4.3514 4.5737 1.0374 1.0864 5.2090 9.0412 1.0960 4.0768 6.6780 3.1320 4.0051 5.5945 5.0007 3.9402 3.9565 3.9318 5.2789 5.1514 5.8752 3.8838 6.1830 5.4016 4.4666 4.4183 3.3159 7.5808 3.6989 6.5380 5.2858 6.7587 4.9783 3.9361 1.5317 4.7098 2.3639 1.2667 4.1498 5.0058 3.7890 3.0075 1.4968 1.9502 1.6605 1.5888 2.9089 1.3184 6.4605 1.5717 2.1707 5.8876 2.7244 3.9536 4.5037 3.7397 6.2800 5.0758 1.5786 1.5598 2.2685 1.5556 3.1918 1.5704 1.0523 1.0696 1.5715 1.2538 1.1193 1.1158 2.4411 4.0237 5.0735 4.7059 1.0373 1.0341 1.0369 1.0964 1.0969 1.1016 1.1004 1.1004 1.1021 1.0935 1.0990 1.0755
irintensity: 1.4282 1.6258 0.8157 0.9350 0.6296 0.3212 0.6539 1.5756 5.0544 0.6654 2.7555 5.8765 4.2876 0.5603 3.8015 2.1738 0.4466 1.3214 1.6430 2.1812 9.0897 2.6363 0.6613 1.4873 7.4779 12.6161 5.2555 0.5966 8.0398 19.0788 15.1261 25.0763 22.1891 28.0138 79.2736 14.6450 6.5412 7.7894 3.5052 16.9630 1.7238 18.0595 23.2671 0.1129 6.6915 4.4795 142.0307 3.7163 31.5993 1.5316 6.1630 13.0631 10.3500 37.0888 483.0025 162.6041 67.8779 43.7563 22.4766 3.5779 28.2477 34.7794 14.9991 22.9023 35.5450 234.2426 45.7087 6.4065 122.4173 445.3125 169.8043 588.5876 20.9223 35.4362 8.5187 10.7255 8.2254 18.6195 0.0380 38.1255 2.3562 5.4149 0.1136 130.4441
temp: 298.150 k
press: 1.00000 atm
elementType: 8 8 7 7 7 7 7 7 6 6 6 6 6 6 6 6 6 6 1 1 1 1 1 1 1 1 1 1 1 1
symmnumber: 1
zpe: 589844.1 jmol-1
zpe.correction: 0.224660 hartree
zpe.thermalcorrener: 0.241849 hartree
zpe.thermalcorrenthalpy: 0.242793 hartree
zpe.thermalcorrgfe: 0.177835 hartree
zpe.sumelectzpe: -865.834537 hartree
zpe.sumelectthermal: -865.817347 hartree
zpe.sumelectthermalent: -865.816403 hartree
zpe.sumelectthermalfe: -865.881361 hartree
dipole: 8.5733 6.0964 -1.9166
dipole: 10.6930
quadrupole: -114.0026 -99.8374 -104.0993
quadrupole: -13.6322 9.6205 -0.7793
quadrupole: -8.0228 6.1424 1.8805 -13.6322 9.6205 -0.7793
hfenergy: -866.0591963 hartree
pointgroup: C01 [X(C10H12N6O2)]
dipole: -2.246207 -1.4981054 3.2262499 debye
polarizability: 247.7681563|21.7172751|97.9842194|-20.5070213|-19.9376313|191.0112808 unknown
InChI: InChI=1S/C10H12N6O2/c1-6-4-7(2)13-10(12-6)14-9-8(16(17)18)11-5-15(9)3/h4-5,14H,1-3H3
charge 0 multiplicity 1
30 atoms
O  1.265132 0.570124 -3.307345
O  3.334005 1.558903 -3.258557
N  2.200241 -0.684834 0.554532
N  0.249697 -0.511849 -1.011553
N  3.800107 0.345561 -0.715638
N  -0.921114 -0.12113 1.040742
N  -2.059954 -0.652331 -1.057656
N  2.409549 0.857061 -2.71064
C  1.557314 -0.283431 -0.6158
C  2.582131 0.333782 -1.389512
C  -0.946442 -0.432489 -0.288719
C  3.542128 -0.268218 0.443246
C  1.679144 -1.535408 1.636476
C  -2.139896 -0.010682 1.66441
C  -3.267527 -0.537055 -0.431766
C  -3.344165 -0.210291 0.949681
C  -2.11325 0.338675 3.132869
C  -4.492691 -0.76628 -1.281303
H  0.14055 -0.428346 -2.038719
H  4.263383 -0.447352 1.237012
H  0.779053 -1.068138 2.064861
H  1.416773 -2.534076 1.24374
H  2.465437 -1.646269 2.399987
H  -4.31168 -0.112731 1.447287
H  -1.611665 -0.459425 3.711045
H  -1.534131 1.26506 3.293696
H  -3.129227 0.477534 3.536034
H  -4.449233 -1.765327 -1.750046
H  -5.420874 -0.684318 -0.69295
H  -4.524796 -0.030923 -2.105215
