program: Gaussian 09
title: 000239059
version: EM64L-G09RevD.01
frameworkgroup: C1[X(C19H15ClN2O)]
method: RPBEPBE
basis: SDD
operation: Freq
keyword: #p
keyword: freq=noraman
keyword: PBEPBE/SDD
title: #p freq=noraman PBEPBE/SDD
converged: YES YES NO NO
title: Mulliken charges:
elementType: Cl O N N C C C C C C C C C C C C C C C C C C C H H H H H H H H H H H H H H H
charge: -0.041946 -0.219210 -0.242668 -0.428054 0.390879 0.448307 -0.387655 -0.378968 -0.364204 -0.378517 0.160914 0.311636 -0.212122 -0.205680 -0.219052 -0.211961 -0.258560 -0.260069 -0.348084 -0.358173 -0.208547 -0.217037 -0.098621 0.314176 0.266325 0.229979 0.252770 0.267624 0.226469 0.223836 0.226000 0.226064 0.229799 0.228868 0.280915 0.232503 0.262313 0.259749
chargesum: 0.00000
title: Mulliken charges with hydrogens summed into heavy atoms:
elementType: Cl O N N C C C C C C C C C C C C C C C C C C C
charge: -0.041946 -0.219210 -0.242668 -0.113877 0.390879 0.448307 -0.121330 -0.148989 -0.111433 -0.110893 0.160914 0.311636 0.014347 0.018156 0.006949 0.014102 -0.028761 -0.031200 -0.067169 -0.125670 0.053766 0.042712 -0.098621
polarizability: 3.31086913e+02 1.05801672e+00 2.51642504e+02 8.94722648e+00 -1.45359576e+01 1.57811992e+02
1716.lowfreq: -9.1135 -6.4856 -4.5431 -0.0025 -0.0019 -0.0008 11.2899 18.7432 27.1583
frequency: 11.1476 18.6583 27.1150 36.0107 57.0619 60.4496 81.7692 90.0331 121.5098 180.1108 208.3475 229.8124 248.9307 255.8154 295.1535 310.8896 366.6449 386.4767 402.9274 407.8594 408.5930 410.7766 461.1510 487.5074 503.4336 506.0061 516.1179 595.8643 612.4522 614.5455 618.5925 622.5903 678.7151 690.3181 693.9443 699.9374 735.0365 743.3623 754.6429 767.4666 825.8543 827.7422 837.6925 848.6737 860.9230 894.6413 907.2723 914.1485 953.9282 964.9313 970.5336 982.9453 983.3054 984.4538 985.6529 988.9726 998.0136 1021.4203 1026.5471 1037.6723 1073.4372 1085.5443 1091.6430 1111.1729 1142.5952 1171.0664 1171.8533 1184.6788 1185.3377 1188.8587 1237.3464 1278.0887 1294.9626 1297.9764 1324.5184 1330.7675 1368.5591 1377.3061 1388.3143 1393.1607 1439.1900 1450.8511 1456.1632 1476.9014 1482.7230 1484.3231 1572.1216 1584.7537 1593.7307 1596.0945 1605.8727 1608.4315 1619.9918 3127.2440 3128.2881 3134.7015 3135.8069 3136.3797 3150.6208 3155.0687 3157.0312 3160.5736 3163.3593 3171.3934 3171.7122 3172.9226 3177.2264 3487.4780
redmass: 4.2028 7.3545 4.0885 6.1699 4.9470 5.4383 5.8026 7.0520 6.9911 5.4794 6.4305 4.9881 6.3942 6.8845 7.0228 5.4622 5.2803 6.3274 2.9981 3.1241 2.9417 5.0748 4.0407 3.5112 3.0642 2.3548 1.8267 5.2316 6.2486 6.4587 6.5739 6.9095 4.6473 2.1145 2.2075 5.8129 3.4638 3.4864 1.6725 2.0293 1.3767 1.2897 1.2837 1.5864 4.8949 1.5207 1.4456 4.5743 1.3716 1.3794 1.3650 1.3936 2.4737 2.4116 2.9975 1.3533 4.3990 2.7931 2.0229 3.4142 2.6782 1.5504 1.5794 1.3717 3.1572 1.0499 1.0477 1.1264 1.1225 1.1325 3.5177 2.9292 1.3811 2.0080 1.7998 1.5356 5.1829 6.4353 8.8445 4.0114 2.3397 2.4331 1.6773 2.2898 2.2374 2.4261 7.7559 6.1871 6.6957 6.2296 6.1246 7.2780 6.8513 1.0846 1.0848 1.0884 1.0891 1.0890 1.0929 1.0930 1.0890 1.0954 1.0954 1.1005 1.0956 1.1001 1.0975 1.0782
irintensity: 0.3303 0.4276 0.7749 0.5075 0.6785 0.8098 2.5145 4.4356 1.9671 2.0225 2.5024 2.5654 3.3323 1.4543 1.3786 0.1885 1.3243 7.5829 2.0596 4.9975 0.2600 5.4143 13.4683 21.3832 37.2970 58.5989 39.3237 18.5417 2.4097 1.5306 17.2668 1.0278 15.9133 59.1262 25.8512 2.4676 18.5966 24.7574 118.1452 3.7109 9.1323 4.6889 0.6094 27.9357 23.7768 1.5509 1.1285 6.2980 0.4877 0.2694 1.1195 2.1423 1.2173 0.6449 0.1320 0.4387 59.3044 1.1310 13.2447 23.7043 64.4525 7.9140 16.5842 14.3701 5.3740 0.4128 0.0443 8.8410 8.9443 1.1781 152.6920 19.5381 15.4786 93.5526 76.9945 18.1784 0.3263 5.7663 3.2761 5.6769 16.3710 3.9257 118.0684 38.5217 89.4159 197.2843 11.0689 9.9267 1.0108 71.6513 168.7400 87.8490 69.7963 6.5197 4.1530 6.2399 12.6768 10.8923 32.8514 34.7482 0.0738 16.6622 21.8652 15.1499 3.2423 6.0474 1.8075 31.1017
temp: 298.150 k
press: 1.00000 atm
elementType: 17 8 7 7 6 6 6 6 6 6 6 6 6 6 6 6 6 6 6 6 6 6 6 1 1 1 1 1 1 1 1 1 1 1 1 1 1 1
symmnumber: 1
zpe: 759815.6 jmol-1
zpe.correction: 0.289398 hartree
zpe.thermalcorrener: 0.309061 hartree
zpe.thermalcorrenthalpy: 0.310006 hartree
zpe.thermalcorrgfe: 0.236849 hartree
zpe.sumelectzpe: -1376.199937 hartree
zpe.sumelectthermal: -1376.180274 hartree
zpe.sumelectthermalent: -1376.179330 hartree
zpe.sumelectthermalfe: -1376.252487 hartree
dipole: 0.3062 -0.6724 -2.7941
dipole: 2.8902
quadrupole: -138.4451 -132.1822 -140.1169
quadrupole: 0.5769 -0.8304 -5.3659
quadrupole: -1.5304 4.7325 -3.2021 0.5769 -0.8304 -5.3659
hfenergy: -1376.4893354 hartree
pointgroup: C01 [X(C19H15Cl1N2O1)]
dipole: -0.2993444 0.300558 -1.05499 debye
polarizability: 322.8087278|1.0783991|250.769299|-37.6860898|17.631728|166.963383 unknown
InChI: InChI=1S/C19H15ClN2O/c20-16-13-11-15(12-14-16)19(23)21-22(17-7-3-1-4-8-17)18-9-5-2-6-10-18/h1-14,21H
charge 0 multiplicity 1
38 atoms
Cl 6.839422 -0.128355 -1.737281
O  0.856503 -0.332697 1.627045
N  -1.289393 0.09019 -0.155296
N  0.063034 0.128042 -0.522505
C  -1.94607 1.343542 0.060065
C  -1.877469 -1.199949 0.058012
C  -3.340254 1.476353 -0.190811
C  -1.446016 -2.314111 -0.708078
C  -1.200371 2.484399 0.459701
C  -2.875124 -1.382682 1.051992
C  1.088539 -0.125874 0.402614
C  2.475653 -0.134744 -0.180792
C  -3.970897 2.725678 -0.023654
C  -2.01579 -3.58606 -0.490841
C  -1.842697 3.731373 0.611881
C  -3.446731 -2.655724 1.25052
C  -3.230454 3.8635 0.376366
C  -3.02593 -3.766588 0.481795
C  3.554912 0.113429 0.706318
C  2.751023 -0.40306 -1.547942
C  4.884729 0.120353 0.241418
C  4.07886 -0.402432 -2.028093
C  5.125343 -0.132531 -1.124803
H  0.276413 0.480755 -1.45993
H  -3.91903 0.609789 -0.524585
H  -0.663936 -2.184213 -1.463122
H  -0.131817 2.388223 0.672209
H  -3.177917 -0.539516 1.679677
H  -5.045164 2.812333 -0.222259
H  -1.671459 -4.437686 -1.088478
H  -1.255059 4.60061 0.928068
H  -4.210257 -2.783505 2.026106
H  -3.725212 4.832457 0.499708
H  -3.46817 -4.754767 0.646041
H  3.33073 0.288361 1.763333
H  1.945533 -0.658457 -2.24589
H  5.717096 0.314808 0.923416
H  4.295929 -0.618946 -3.077824
