program: Gaussian 09
title: 000239003
version: EM64L-G09RevD.01
frameworkgroup: C1[X(C8H8F6N2O2)]
method: RPBEPBE
basis: SDD
operation: Freq
keyword: #p
keyword: freq=noraman
keyword: PBEPBE/SDD
title: #p freq=noraman PBEPBE/SDD
converged: YES YES NO NO
title: Mulliken charges:
elementType: F F F F F F O O N N C C C C C C C C H H H H H H H H
charge: -0.161783 -0.167971 -0.113417 -0.161782 -0.167986 -0.113413 -0.223018 -0.222996 -0.128022 -0.127997 -0.375175 -0.385646 -0.374886 -0.385990 0.189086 0.189108 0.305146 0.305075 0.252863 0.279925 0.256506 0.271558 0.252916 0.279834 0.256436 0.271629
chargesum: 0.00000
title: Mulliken charges with hydrogens summed into heavy atoms:
elementType: F F F F F F O O N N C C C C C C C C
charge: -0.161783 -0.167971 -0.113417 -0.161782 -0.167986 -0.113413 -0.223018 -0.222996 -0.128022 -0.127997 0.157613 0.142417 0.157864 0.142076 0.189086 0.189108 0.305146 0.305075
polarizability: 1.46059638e+02 -8.86684078e-03 1.01214271e+02 -6.33185938e+00 -1.75466875e-02 7.65668120e+01
1716.lowfreq: -16.0069 -5.4596 -0.0009 -0.0006 0.0005 3.7724 11.9965 44.4737 56.5414
frequency: 9.8756 44.4736 56.5410 74.2492 77.7275 94.7720 111.2204 153.6018 201.1665 208.7827 230.5685 249.0375 263.8569 286.2405 293.1965 339.5037 344.9043 359.0308 373.9399 409.3220 451.3699 456.5790 471.1118 498.7389 539.5762 575.1247 609.8169 619.1699 667.1969 674.0192 698.6439 699.2613 827.5944 849.4396 881.0039 974.3899 976.7167 980.3057 986.6237 1016.5984 1058.5805 1065.6449 1076.6728 1085.0505 1137.3774 1140.3386 1165.7507 1199.0719 1217.3967 1247.4703 1256.3767 1292.6753 1338.0661 1355.5909 1363.8912 1368.6242 1398.3596 1399.0233 1469.5779 1470.4583 1485.8966 1488.2228 1619.0627 1620.8607 2992.5570 3003.2617 3004.0800 3013.5237 3079.7589 3082.3571 3103.3921 3103.9622
redmass: 7.8376 15.1749 10.2192 12.3808 10.7975 3.5745 6.2969 9.3383 10.2204 4.4632 6.7932 11.1668 6.0454 1.9292 7.3108 8.3449 3.7380 6.1814 10.7113 11.0800 11.8087 14.1977 6.7805 3.6456 11.0094 2.9822 9.4512 5.1903 4.9660 7.4218 11.9588 11.7097 5.2546 1.6276 4.9182 11.6343 12.7848 2.2439 2.5516 2.4999 8.9015 4.6079 2.4190 2.2934 4.0764 4.7863 4.6558 2.8600 1.3841 1.4893 1.5704 1.3478 1.5039 1.5638 1.7789 1.4262 2.6400 2.0497 1.0778 1.0868 1.0767 1.0785 10.7469 11.5799 1.0689 1.0697 1.0638 1.0640 1.0945 1.1009 1.0948 1.1002
irintensity: 5.8271 0.0625 0.7951 5.7940 2.4956 0.0078 0.0651 2.9920 4.7084 0.4052 0.4004 4.3958 9.1874 0.0086 11.8460 5.0324 2.2792 0.6417 20.9249 0.2054 6.4531 0.9140 0.8884 3.6904 0.0006 13.2491 8.8186 41.8403 0.2965 0.3519 3.3492 29.9396 18.3175 0.3398 27.5133 26.1611 403.8628 9.7636 74.9422 77.4889 189.2065 127.6072 2.2679 4.4363 469.5563 31.1521 30.2065 12.2009 8.2304 16.8163 0.2951 26.8482 0.5619 3.5906 16.4116 0.3900 0.8678 92.5778 7.5165 42.8064 5.0623 21.6651 533.9584 136.7352 12.2529 3.8014 21.1635 35.3349 2.3774 8.0509 2.9108 5.4158
temp: 298.150 k
press: 1.00000 atm
elementType: 9 9 9 9 9 9 8 8 7 7 6 6 6 6 6 6 6 6 1 1 1 1 1 1 1 1
symmnumber: 1
zpe: 444641.3 jmol-1
zpe.correction: 0.169355 hartree
zpe.thermalcorrener: 0.186459 hartree
zpe.thermalcorrenthalpy: 0.187404 hartree
zpe.thermalcorrgfe: 0.122085 hartree
zpe.sumelectzpe: -1167.274510 hartree
zpe.sumelectthermal: -1167.257405 hartree
zpe.sumelectthermalent: -1167.256461 hartree
zpe.sumelectthermalfe: -1167.321779 hartree
dipole: 0.0008 -0.6902 0.0078
dipole: 0.6903
quadrupole: -143.7998 -104.5226 -101.1914
quadrupole: 0.0036 4.4771 0.0076
quadrupole: -27.2952 11.9820 15.3132 0.0036 4.4771 0.0076
hfenergy: -1167.4438645 hartree
pointgroup: C01 [X(C8H8F6N2O2)]
dipole: 0.000157 -0.2715608 0.00252 debye
dipolederiv: -0.4377874 -0.0483552 0.0624686 -0.0531458 -0.3999387 -0.2073685 0.0758882 -0.169856 -0.7194186 -0.4423804 -0.039339 -0.061393 -0.0271235 -0.6303997 0.2591105 -0.0716886 0.2160236 -0.49987 -0.8890364 0.0602544 -0.0003816 -0.0333264 -0.2879698 -0.0061877 -0.0355436 -0.0068185 -0.2532132 -0.4372107 0.0485784 0.0619336 0.0534766 -0.4010697 0.2082254 0.0752716 0.1706324 -0.7187997 -0.442896 0.0388724 -0.0617862 0.0264015 -0.629071 -0.2593699 -0.0720423 -0.2164072 -0.5008866 -0.8891602 -0.0598269 0.0008418 0.0338923 -0.2879439 0.0061083 -0.0338893 0.0069391 -0.2531365 -0.9074323 0.0875543 0.0479307 0.5620271 -0.6779253 -0.1382597 0.2082552 -0.1167259 -0.3531032 -0.9072608 -0.0874175 0.0483023 -0.5623595 -0.6783844 0.137833 0.2074925 0.115776 -0.35257 -1.250488 0.1908102 0.0927975 -0.032384 -0.465959 -0.0836753 0.0096524 -0.0501733 -0.3227793 -1.2503557 -0.1907118 0.0933616 0.0323404 -0.4662937 0.0831612 0.0112137 0.0500016 -0.3224584 0.2375058 0.1731006 0.074442 0.3310698 0.2709889 0.0374415 0.0354221 0.0684017 0.2668305 0.2648357 -0.2041297 -0.0736002 -0.3117498 0.2988547 0.094244 -0.0597706 0.0780356 0.2846317 0.2379166 -0.1733238 0.0737989 -0.3308047 0.2718516 -0.0372483 0.0341144 -0.0682561 0.2662185 0.264768 0.2043918 -0.0730496 0.3120827 0.29891 -0.0943874 -0.0589524 -0.0781357 0.2844341 1.5966631 -0.2672687 -0.1373804 -0.4684714 0.6428612 0.2096629 -0.1918501 0.1716595 0.1383471 1.5963307 0.2670157 -0.1385404 0.4682908 0.643727 -0.208553 -0.1929651 -0.1704573 0.1375393 1.7143635 0.0133666 -0.0002252 0.0608659 1.1542237 -0.1022246 0.0182642 -0.0846936 1.4849964 1.714394 -0.0135356 -0.0002922 -0.0609568 1.1536136 0.1010883 0.0180748 0.0835581 1.4856504 0.0049685 -0.0477815 -0.0318208 -0.0971017 0.0548364 0.0355975 -0.0407987 -0.0304744 -0.0998161 0.0372083 0.0844342 -0.0251914 -0.0155425 0.0148465 0.0178738 -0.0137971 0.0236802 0.0912656 0.019608 0.0627451 0.0234619 0.1043342 0.039916 0.0162299 0.0443574 -0.0460304 -0.0975954 0.0519358 -0.0521035 0.0290564 0.0021682 -0.0147421 0.0054319 0.0217531 0.0300664 0.0800717 0.0050052 0.0478739 -0.0315237 0.0971717 0.0547308 -0.0349843 -0.0403784 0.0310939 -0.0997301 0.036782 -0.0842999 -0.0256133 0.0155974 0.0148328 -0.0182485 -0.0137594 -0.0239524 0.0910041 0.0194677 -0.0628266 0.0233642 -0.104501 0.0399347 -0.0158589 0.0441094 0.0463795 -0.0976857 0.0522551 0.0519223 0.0290384 -0.0022514 -0.0144306 -0.0056422 0.0215665 -0.0302665 0.0800736 unknown
polarizability: 146.3659199|-0.0077263|101.2142375|-4.3259886|0.035318|76.2605641 unknown
InChI: InChI=1S/C8H8F6N2O2/c9-7(10,11)5(17)15-1-2-16(4-3-15)6(18)8(12,13)14/h1-4H2
charge 0 multiplicity 1
26 atoms
F  -3.321658 -1.186496 -1.500596
F  -3.408852 -1.755156 0.706535
F  -5.012902 -0.438182 -0.196696
F  3.324417 -1.191962 1.492753
F  3.405668 -1.754433 -0.716193
F  5.012961 -0.441216 0.186765
O  -3.438825 1.636283 0.5038
O  3.438721 1.636637 -0.503197
N  -1.458573 0.470755 0.080354
N  1.4586 0.470817 -0.080173
C  -0.656787 1.685697 0.397106
C  -0.693541 -0.737061 -0.334167
C  0.657019 1.687273 -0.391793
C  0.693478 -0.737915 0.331419
C  -2.828773 0.587002 0.160472
C  2.828725 0.586607 -0.162062
C  -3.649301 -0.687435 -0.207465
C  3.649205 -0.689475 0.200223
H  -0.459357 1.729359 1.485595
H  -1.259422 2.572854 0.139692
H  -0.585812 -0.761609 -1.43492
H  -1.226088 -1.649233 -0.024751
H  0.459584 1.735516 -1.480089
H  1.259801 2.573271 -0.130717
H  0.585795 -0.765128 1.43212
H  1.225921 -1.649371 0.019783
