program: Gaussian 09
title: 000239004
version: EM64L-G09RevD.01
frameworkgroup: C1[X(C9H10Cl3NO2)]
method: RPBEPBE
basis: SDD
operation: Freq
keyword: #p
keyword: freq=noraman
keyword: PBEPBE/SDD
title: #p freq=noraman PBEPBE/SDD
converged: YES YES NO NO
title: Mulliken charges:
elementType: Cl Cl Cl O O N C C C C C C C C C H H H H H H H H H H
charge: 0.144525 0.107497 0.105562 -0.258202 -0.152464 -0.020954 -0.325669 -0.288544 -0.491775 -0.483633 -0.464519 -0.487396 0.284495 0.468675 -0.715240 0.249142 0.293294 0.250325 0.256348 0.279388 0.241719 0.254510 0.250793 0.240506 0.261620
chargesum: 0.00000
title: Mulliken charges with hydrogens summed into heavy atoms:
elementType: Cl Cl Cl O O N C C C C C C C C C
charge: 0.144525 0.107497 0.105562 -0.258202 -0.152464 -0.020954 -0.076528 0.004750 0.014897 0.037474 0.040784 0.014731 0.284495 0.468675 -0.715240
polarizability: 1.80165262e+02 -1.34627351e+01 1.44874628e+02 -4.90385850e+00 5.42799892e-01 1.11843801e+02
1716.lowfreq: -2.9258 0.0015 0.0017 0.0022 4.9283 6.2305 10.6496 29.6799 43.1386
frequency: 9.3714 29.6548 43.1234 49.1661 56.6369 80.7415 127.4700 152.3206 154.6443 195.2932 215.0689 243.3166 256.1410 274.0661 283.0316 293.2377 363.9190 372.8130 388.9520 493.1282 538.3787 598.4023 646.3330 657.5327 743.4752 746.3026 748.2883 781.0117 797.7264 801.9722 807.2805 823.0039 874.4821 878.2095 899.7805 918.6862 937.0462 1009.3981 1043.4266 1051.1275 1068.4353 1081.6158 1084.7935 1092.9292 1103.9951 1111.5710 1172.0147 1174.7960 1197.0273 1209.0562 1268.8160 1350.3683 1395.7723 1434.8200 1448.0465 1456.7221 1471.6865 1552.5445 1678.4298 3100.6750 3105.3339 3111.9111 3112.4635 3138.9782 3180.4258 3202.8372 3206.9585 3221.5181 3226.6630
redmass: 7.7399 6.0832 4.0940 4.9473 6.3363 3.3374 5.5143 4.8039 7.8536 5.7183 6.0082 10.8970 6.6208 6.7647 10.7526 6.9323 5.1730 5.3805 19.2164 3.4944 5.3719 13.6014 4.8841 4.0597 3.6510 6.5634 10.9720 1.1024 1.4067 2.2884 1.8480 5.0010 1.6468 3.6863 2.0971 8.6818 4.5817 1.7410 1.1960 1.1702 1.2389 1.1365 1.7633 1.3299 4.1752 1.1378 1.4131 1.3766 2.7746 2.1361 1.6021 1.8722 2.5710 1.0861 1.0891 1.2718 1.2311 6.2920 13.0419 1.0529 1.0511 1.0602 1.0626 1.0897 1.0911 1.1172 1.1177 1.1139 1.1155
irintensity: 0.1571 1.0286 0.1847 0.1373 0.1353 0.0477 2.5951 1.6499 1.8113 0.4214 0.4010 1.7158 0.2976 1.1336 4.4658 0.2244 0.3966 1.7571 2.3512 3.6830 15.5716 115.7312 7.8311 0.5256 29.0259 55.6554 66.8525 11.1745 8.1020 10.4289 7.8996 234.5426 18.4139 91.5434 3.2319 38.9530 108.8268 28.0924 7.4316 32.9057 6.6016 18.0194 65.7899 3.4356 239.6684 0.8840 1.7573 0.7894 0.2301 0.9134 17.3232 9.0493 45.3991 11.2213 12.0350 8.2500 4.0720 119.3283 240.4084 12.8765 14.8949 12.3593 6.7833 10.1001 1.6871 0.1564 2.6675 17.5482 10.3199
temp: 298.150 k
press: 1.00000 atm
elementType: 17 17 17 8 8 7 6 6 6 6 6 6 6 6 6 1 1 1 1 1 1 1 1 1 1
symmnumber: 1
zpe: 456645.5 jmol-1
zpe.correction: 0.173927 hartree
zpe.thermalcorrener: 0.190387 hartree
zpe.thermalcorrenthalpy: 0.191331 hartree
zpe.thermalcorrgfe: 0.125678 hartree
zpe.sumelectzpe: -1933.060991 hartree
zpe.sumelectthermal: -1933.044531 hartree
zpe.sumelectthermalent: -1933.043587 hartree
zpe.sumelectthermalfe: -1933.109240 hartree
dipole: -5.1384 2.8672 0.4357
dipole: 5.9004
quadrupole: -94.0313 -110.3753 -107.2110
quadrupole: -0.0108 0.3679 -1.6531
quadrupole: 9.8412 -6.5028 -3.3385 -0.0108 0.3679 -1.6531
hfenergy: -1933.2349178 hartree
pointgroup: C01 [X(C9H10Cl3N1O2)]
dipole: -1.9254877 -1.2802457 0.205696 debye
dipolederiv: -0.5799517 -0.3422112 0.0083868 -0.314799 -0.3244642 0.0083496 0.0174923 0.0131163 -0.1172747 -0.2319288 -0.0376944 -0.061393 0.0220665 -0.2414562 -0.2801139 -0.0304038 -0.2183285 -0.6703608 -0.2269078 0.0322705 -0.0390878 0.1020955 -0.4266122 0.3418239 -0.0411703 0.2982662 -0.484688 -2.0582503 -0.3462677 0.2567069 -0.144007 -0.4886914 -0.0035061 0.3176618 0.010935 -0.1424688 -0.5909769 0.0602798 0.0666036 -0.5588158 -0.9014945 0.0147367 0.0253169 -0.0696703 -0.2281243 0.3723917 0.026055 -0.1064799 -0.819515 -0.3564599 0.1020568 -0.1255625 0.0261964 -0.1040551 -0.2931813 0.2540516 -0.0721779 0.3339421 -0.318127 0.1032185 -0.226953 0.121402 0.0212897 -0.211016 -0.2890163 0.0706646 -0.2900548 -0.5836527 0.0981205 0.0509506 0.0970707 0.1057473 0.0349045 0.0178185 -0.0419051 -0.2501282 0.1514406 -0.054898 -0.0333745 0.0099646 -0.1024421 0.0915417 -0.0360598 -0.0492193 -0.0719594 -0.0863252 -0.0501784 0.1399144 -0.182673 0.0247738 0.0822338 0.0824667 -0.0842637 -0.0377994 0.1146388 -0.002501 -0.2110744 -0.2475402 -0.0114455 0.1858815 0.1805487 -0.0302932 -0.0118777 0.1358221 0.0009022 0.11282 0.189509 -0.1146746 0.7004479 -0.273843 0.0397458 0.4062258 0.8458612 -0.1029211 -0.0093435 0.0315569 -0.0161506 1.8961828 0.150782 -0.288967 0.97879 1.2135448 -0.0250059 -0.2639795 0.0792178 0.1079692 0.8705049 0.4371998 0.1461856 0.4056747 0.9474115 -0.1206281 0.1377437 -0.1231195 1.3397786 -0.0376785 -0.0452332 0.0461373 -0.004094 -0.0232926 0.0826231 0.0604208 0.0738456 0.0550564 0.0047124 0.050332 0.0174955 0.0282895 0.0078797 0.0038265 0.0131673 -0.0089218 0.0952005 -0.1162351 -0.0183855 -0.0657892 0.0232246 0.094286 -0.0054216 -0.0685571 0.0141115 0.0462156 0.029678 -0.0163769 0.075376 -0.004619 0.1043543 0.0085466 0.0317897 0.0097115 -0.0360225 0.0448149 -0.0924452 -0.0020611 -0.0508681 0.0602046 -0.0280349 0.0111269 -0.0202768 0.0923435 -0.0206594 0.056141 0.1004004 0.0629357 0.0410075 -0.0494081 0.0797358 -0.0665838 0.0226433 0.0438837 0.0121652 0.0245046 0.004608 -0.0521412 -0.0851659 -0.0055978 -0.0821358 0.0277677 -0.0377036 0.0475213 -0.0690842 0.0787209 0.0739209 0.0142787 -0.0552769 0.0037379 0.0519336 0.011294 0.0431949 0.0894147 0.0691491 0.0544237 -0.0556479 0.0725369 -0.0286165 -0.0001281 0.0360176 0.0467061 -0.0309004 0.042815 -0.0420787 0.0849477 0.0006163 0.069225 0.037116 unknown
polarizability: 177.8248193|15.7792826|146.7612881|-5.1199335|-4.8323046|112.2975826 unknown
InChI: InChI=1S/C9H10Cl3NO2/c10-9(11,12)8(14)15-13-7(5-1-2-5)6-3-4-6/h5-6H,1-4H2
charge 0 multiplicity 1
25 atoms
Cl 4.522197 1.251354 -0.649315
Cl 2.845549 -0.672654 -2.274575
Cl 3.268722 -1.14361 0.704213
O  0.701792 0.114674 -0.215354
O  1.737955 2.236808 -0.20593
N  -0.618779 0.815049 0.030165
C  -2.939093 0.46283 0.351141
C  -1.359987 -1.575747 0.18474
C  -3.564921 1.284943 -0.813356
C  -3.176089 1.975787 0.489499
C  -2.475388 -2.516517 -0.337363
C  -2.159232 -2.491754 1.150013
C  -1.561725 -0.102739 0.190431
C  1.757783 1.006285 -0.314573
C  3.040059 0.163372 -0.612882
H  -3.631162 -0.190289 0.890751
H  -0.334041 -1.887767 -0.016162
H  -4.623546 1.120636 -1.034646
H  -2.926433 1.453138 -1.684968
H  -2.288755 2.612405 0.48028
H  -3.973162 2.292023 1.168105
H  -2.148693 -3.37329 -0.932435
H  -3.405596 -2.053982 -0.677887
H  -2.876192 -2.026647 1.832138
H  -1.604663 -3.326705 1.585973
