program: Gaussian 09
title: 000239126
version: EM64L-G09RevD.01
frameworkgroup: C1[X(C27H28N2O)]
method: RPBEPBE
basis: SDD
operation: Freq
keyword: #p
keyword: freq=noraman
keyword: PBEPBE/SDD
title: #p freq=noraman PBEPBE/SDD
converged: YES YES NO NO
title: Mulliken charges:
elementType: O N N C C C C C C C C C C C C C C C C C C C C C C C C C C C H H H H H H H H H H H H H H H H H H H H H H H H H H H H
charge: -0.431551 -0.155073 -0.156033 -0.390709 0.212271 0.488452 0.413560 0.178475 0.175275 0.429627 -0.457830 -0.380786 -0.359213 -0.396474 -0.399637 -0.431433 -0.474725 0.396437 0.397714 -0.371459 -0.400699 -0.399513 -0.389932 -0.444900 -0.270414 -0.256608 -0.647333 -0.646785 -0.647294 -0.646879 0.192241 0.227405 0.229538 0.250187 0.240088 0.230722 0.213011 0.236651 0.229739 0.229276 0.229964 0.231324 0.237315 0.223598 0.226439 0.349542 0.229512 0.230206 0.211805 0.230151 0.211895 0.228981 0.230262 0.212035 0.229779 0.229295 0.230332 0.212179
chargesum: 0.00000
title: Mulliken charges with hydrogens summed into heavy atoms:
elementType: O N N C C C C C C C C C C C C C C C C C C C C C C C C C C C
charge: -0.082010 -0.155073 -0.156033 -0.198468 0.212271 0.488452 0.413560 0.178475 0.175275 0.429627 -0.230424 -0.151248 -0.109026 -0.156387 -0.168915 -0.218423 -0.238074 0.396437 0.397714 -0.141720 -0.171423 -0.169548 -0.158607 -0.207585 -0.046816 -0.030169 0.024190 0.024241 0.024781 0.024927
polarizability: 3.54088483e+02 6.12996395e+00 3.81422803e+02 9.67664962e-01 -2.02504590e+01 2.67538914e+02
1716.lowfreq: -8.7118 -1.9143 -0.0006 -0.0001 0.0006 5.6631 11.1463 23.0730 25.3842
frequency: 9.5471 23.0065 25.3730 37.0475 40.9461 46.4720 68.4618 73.2630 75.5891 81.6639 101.6943 112.7719 126.2030 133.9301 164.4051 174.4470 178.5165 199.5488 206.2438 212.3265 218.3589 229.7813 275.3552 291.2493 298.9187 325.3781 326.9285 333.3976 361.9655 389.5311 414.6350 418.5448 421.1405 424.1673 426.0166 459.8474 472.1368 478.2565 513.5813 516.7820 522.5804 527.5995 533.9425 569.0971 573.8324 630.3804 633.2358 639.5668 667.5632 689.4891 705.5304 718.6518 731.6684 740.1291 750.6860 767.4094 784.8505 787.9630 802.6844 804.2091 807.6889 816.2598 829.9954 858.2553 870.7396 878.1142 924.7784 932.3124 940.7399 944.3788 945.6503 949.8176 958.1160 960.2173 966.3803 985.6285 999.4831 1001.1574 1034.2414 1047.8394 1055.1144 1056.3932 1108.2212 1108.8204 1111.5279 1112.3403 1129.9623 1131.7905 1144.3653 1160.7466 1161.7552 1164.4006 1175.0514 1178.1275 1195.1448 1206.2373 1214.5609 1222.8670 1232.3353 1245.1099 1251.2537 1264.1922 1266.6369 1266.7949 1288.1927 1323.1972 1331.9738 1354.4613 1355.0546 1360.7063 1374.9420 1383.0589 1402.6119 1419.3803 1422.6205 1424.4236 1432.6863 1434.8818 1436.0417 1457.3631 1458.3845 1460.6012 1461.5164 1469.0965 1471.0261 1471.8206 1495.3484 1495.5797 1507.7185 1508.0216 1515.6524 1522.5640 1525.4742 1562.7672 1569.7340 1587.2816 1608.5996 1631.1618 1632.8003 1635.2304 2926.6334 2926.7851 2935.8360 2936.3861 2988.0934 2988.7597 2990.6145 2991.2447 2995.1070 3086.0823 3087.9754 3097.0268 3097.6353 3104.2757 3104.9930 3116.7950 3117.7824 3129.7732 3133.7124 3140.3343 3140.4521 3149.7658 3156.4510 3156.8407 3162.4102 3163.5654 3163.6321 3574.1161
redmass: 3.9132 4.2219 4.3819 3.2496 4.1469 3.9734 2.8088 2.4477 2.4487 2.5284 3.5547 2.2141 2.5033 4.2944 5.2445 3.8800 3.4699 1.2165 1.3381 1.6926 2.3311 2.7429 3.4642 3.2742 1.2112 4.2557 4.4220 4.8587 4.7779 3.7141 2.9686 3.0985 3.2700 4.4427 3.9544 4.0874 3.5728 3.7408 3.0005 3.3479 3.4986 3.4264 3.2212 3.7548 3.3633 6.3573 6.6876 6.6633 3.6708 3.9688 4.0244 4.2397 4.5176 4.5014 1.3634 4.2680 3.2027 3.5578 1.4804 1.2853 1.2959 1.7387 2.3120 2.5822 3.9046 2.6677 2.8292 1.3410 1.4195 2.9197 2.7958 1.8045 1.3477 1.4166 1.3587 1.3401 3.1090 3.0024 2.2475 3.2423 1.4858 1.4825 1.3155 1.3149 1.2391 1.2385 1.4938 1.4682 1.4800 1.8571 1.2042 1.7594 1.1272 1.7811 1.4006 1.2448 1.5242 1.8417 1.8042 3.4781 1.5541 2.0243 2.7004 2.6582 1.5407 1.4939 1.4233 3.2805 3.3515 2.6792 3.8112 5.0609 3.1438 2.3436 2.2003 2.2393 2.9016 1.4941 1.6425 1.2142 1.2113 1.0412 1.0407 2.6919 1.0472 1.0469 1.0808 1.0821 1.1118 1.1226 3.6184 2.4580 2.4716 6.5977 6.7363 7.7466 5.6955 6.2817 6.4778 6.2009 1.0370 1.0369 1.0398 1.0398 1.0986 1.0985 1.1029 1.1027 1.0800 1.0957 1.0953 1.0934 1.0933 1.0876 1.0891 1.0867 1.0886 1.0882 1.0873 1.0925 1.0903 1.0936 1.0926 1.0928 1.0942 1.0980 1.0967 1.0661
irintensity: 0.0128 0.5486 0.5085 0.4589 2.1303 1.3266 2.9913 0.4752 3.7274 1.0810 0.0554 0.2716 0.0805 0.0229 0.1858 0.4799 1.2593 0.3395 0.7210 3.6459 4.2816 7.6847 2.0072 6.9309 88.3915 5.0498 3.5512 1.1010 0.9401 0.6412 0.6908 0.4910 1.6552 4.7987 6.7030 8.1537 3.8500 0.0888 7.9346 7.4227 12.8348 4.6102 6.7436 10.6066 3.0812 3.5911 2.2876 6.2778 2.1656 9.1111 1.0599 1.1214 2.0893 2.2216 32.1633 27.1113 9.9274 26.2997 78.7197 4.4271 3.0239 31.7103 38.9823 7.9716 2.3044 0.0562 40.3602 1.6244 3.7243 11.6847 29.7042 16.9180 1.5842 3.6008 1.0572 0.1551 1.9773 2.0349 8.2715 39.6117 26.3323 25.1170 1.2569 1.3959 0.0076 0.0050 4.4580 3.7359 29.6232 38.5491 9.2640 21.3394 0.1556 20.3007 41.1918 22.8266 34.0294 9.3408 16.7707 78.4228 7.3106 18.1815 37.3691 32.0366 7.0700 8.4066 8.7449 89.4383 174.7077 12.0794 3.2239 12.4871 8.0190 11.8373 2.0788 17.6314 1.7400 0.1643 0.4533 17.0060 18.0779 0.1303 0.0524 7.4133 19.0830 19.1175 2.3345 2.7932 21.4012 28.9211 22.5010 507.8043 187.7576 8.9621 28.0166 1.1075 11.7393 180.1561 47.5903 100.5768 129.1847 122.3718 161.0403 66.5359 0.7841 0.2669 100.0763 99.1953 9.8704 4.6732 4.4225 64.1281 59.5679 9.4849 17.4780 5.0487 16.8029 7.0377 14.1461 20.0546 19.5062 43.8480 31.8243 28.4637 13.8026 32.9541 3.1664 37.2610
temp: 298.150 k
press: 1.00000 atm
elementType: 8 7 7 6 6 6 6 6 6 6 6 6 6 6 6 6 6 6 6 6 6 6 6 6 6 6 6 6 6 6 1 1 1 1 1 1 1 1 1 1 1 1 1 1 1 1 1 1 1 1 1 1 1 1 1 1 1 1
symmnumber: 1
zpe: 1252724.0 jmol-1
zpe.correction: 0.477137 hartree
zpe.thermalcorrener: 0.505644 hartree
zpe.thermalcorrenthalpy: 0.506588 hartree
zpe.thermalcorrgfe: 0.415185 hartree
zpe.sumelectzpe: -1228.246809 hartree
zpe.sumelectthermal: -1228.218302 hartree
zpe.sumelectthermalent: -1228.217358 hartree
zpe.sumelectthermalfe: -1228.308761 hartree
dipole: -0.4476 -1.7853 1.8363
dipole: 2.5999
quadrupole: -142.9629 -156.8170 -161.6377
quadrupole: -1.4069 -0.6843 2.2634
quadrupole: 10.8429 -3.0112 -7.8318 -1.4069 -0.6843 2.2634
hfenergy: -1228.723946 hartree
pointgroup: C01 [X(C27H28N2O1)]
dipole: 0.188278 -0.5364247 0.8503423 debye
polarizability: 355.4004942|-6.227251|368.4203814|10.3296223|-38.9435676|279.2293239 unknown
InChI: InChI=1S/C27H28N2O/c1-28(2)22-14-9-20(10-15-22)26(21-11-16-23(17-12-21)29(3)4)27-24-8-6-5-7-19(24)13-18-25(27)30/h5-18,26,30H,1-4H3
charge 0 multiplicity 1
58 atoms
O  -0.358697 0.476809 2.257545
N  -3.059726 -4.745708 0.955169
N  5.724768 -0.160034 -0.174994
C  -0.09413 0.05344 -0.552443
C  -0.763298 1.308094 0.032588
C  -0.839382 -1.231612 -0.121482
C  1.434686 0.001491 -0.377283
C  -1.278357 2.364153 -0.815773
C  -0.935596 1.449893 1.422458
C  -2.009376 3.479205 -0.232036
C  -2.087135 -1.531357 -0.72182
C  2.183405 1.02731 0.244147
C  -0.353732 -2.138954 0.849486
C  2.16487 -1.079409 -0.936931
C  -1.096761 2.380221 -2.244378
C  -1.650152 2.54475 2.001074
C  -2.18866 3.534905 1.186275
C  -2.33535 -3.595739 0.60277
C  4.323491 -0.106941 -0.242082
C  -2.828403 -2.677911 -0.377035
C  3.590573 0.984612 0.317141
C  -1.073349 -3.295295 1.206121
C  3.568565 -1.144109 -0.877039
C  -2.534725 4.514252 -1.073384
C  -1.613097 3.40656 -3.039009
C  -2.348091 4.4849 -2.455284
C  -4.343174 -5.028667 0.307158
C  -2.522464 -5.672798 1.954613
C  6.467426 0.930626 0.462501
C  6.445078 -1.28782 -0.772442
H  -0.262118 0.100409 -1.645354
H  -2.497399 -0.847911 -1.477673
H  1.661127 1.884905 0.681826
H  0.603184 -1.93066 1.338057
H  1.618968 -1.894329 -1.42882
H  -0.523197 1.584967 -2.729052
H  -1.767993 2.595781 3.091987
H  -2.744222 4.372433 1.623373
H  -3.7853 -2.858183 -0.875744
H  4.116046 1.807646 0.81026
H  -0.649417 -3.965784 1.959835
H  4.076752 -2.001302 -1.328413
H  -3.086241 5.338644 -0.604757
H  -1.448258 3.388327 -4.122266
H  -2.751348 5.281046 -3.090346
H  -0.645725 0.606263 3.195349
H  -4.237013 -5.150062 -0.79148
H  -5.084436 -4.221934 0.486023
H  -4.76024 -5.965241 0.71114
H  -1.548693 -6.104499 1.640937
H  -3.229653 -6.505149 2.101146
H  -2.370129 -5.179614 2.937484
H  6.297803 1.903339 -0.045717
H  7.546865 0.712645 0.423056
H  6.185001 1.05502 1.528808
H  6.271824 -1.36162 -1.866891
H  6.146548 -2.255731 -0.318556
H  7.527457 -1.159874 -0.609843
