program: Gaussian 09
title: 000239013
version: EM64L-G09RevD.01
frameworkgroup: C1[X(C16H22O5)]
method: RPBEPBE
basis: SDD
operation: Freq
keyword: #pfreq=noraman
keyword: PBEPBE/SDD
title: #p freq=noraman PBEPBE/SDD
converged: YES YES NO NO
title: Mulliken charges:
elementType: O O O O O C C C C C C C C C C C C C C C C H H H H H H H H H H H H H H H H H H H H H H
charge: -0.282324 -0.261916 -0.265783 -0.236323 -0.233688 -0.384948 -0.313444 -0.438864 -0.316998 0.253429 0.236456 0.377752 -0.264104 -0.267493 -0.350270 -0.385169 -0.661574 -0.657648 -0.224388 -0.198411 -0.258942 0.251812 0.215271 0.281501 0.245514 0.232535 0.220248 0.204452 0.234682 0.226127 0.223625 0.233716 0.249841 0.246312 0.216878 0.228443 0.251398 0.213528 0.251153 0.234215 0.221953 0.225039 0.226406
chargesum: 0.00000
title: Mulliken charges with hydrogens summed into heavy atoms:
elementType: O O O O O C C C C C C C C C C C C C C C C
charge: -0.282324 -0.261916 -0.265783 -0.236323 -0.233688 0.082135 -0.031942 0.039185 0.107703 0.253429 0.236456 0.377752 0.196705 0.189848 -0.100429 -0.138858 0.035145 0.041248 -0.002435 0.026628 -0.032536
polarizability: 2.43893716e+02 -2.27427459e+00 1.93312547e+02 9.40453931e+00 -1.36177045e+01 1.26178756e+02
1716.lowfreq: -7.7312 -4.2718 -0.0006 0.0002 0.0006 0.3776 6.8051 10.8389 27.7103
frequency: 4.1272 10.6888 27.6771 33.1842 37.2934 52.2503 55.2294 75.8940 84.5309 97.2870 108.4426 116.3987 155.6631 164.0423 191.8898 208.3704 226.6046 233.6370 246.8069 273.5979 293.2370 316.9721 336.3362 370.3555 412.7748 413.5971 426.2339 440.1359 504.6315 528.7763 556.5068 596.8287 609.8254 656.2054 693.0405 705.9327 726.3079 747.0081 758.5224 775.4143 802.5096 808.1740 817.3477 822.9482 832.5665 835.9523 887.4813 896.3903 915.0426 937.7620 960.6031 980.7523 982.6659 1004.2836 1012.5794 1021.6053 1032.3931 1048.8296 1083.2833 1089.9305 1094.9370 1097.8026 1104.5119 1120.9847 1151.7807 1157.0026 1157.7421 1166.5140 1179.0003 1189.5561 1219.6830 1220.9219 1250.6042 1276.8429 1278.0423 1290.5062 1314.2849 1324.8299 1328.3836 1354.5050 1356.3808 1367.7825 1381.9210 1389.3213 1391.1634 1393.9414 1443.2041 1453.2249 1456.5616 1457.7921 1461.6112 1462.2137 1467.8435 1471.4256 1482.9396 1484.3643 1485.9105 1590.3603 1611.9093 1635.8313 1642.7806 2951.1920 2993.5186 2995.6472 2999.5267 3005.7561 3022.0856 3028.1904 3029.9890 3030.3134 3060.7334 3084.7128 3088.9771 3091.4739 3094.5874 3096.0478 3120.6160 3121.7925 3126.4625 3135.0147 3154.5984 3163.5371 3171.9932
redmass: 4.4635 4.5791 3.6275 4.5930 3.7032 3.4754 3.6096 3.8339 4.3088 4.9794 3.8260 5.2912 2.8131 3.1239 1.7322 1.4030 1.9394 4.3129 2.0556 2.4214 3.1024 3.2623 5.0739 4.5156 2.9509 4.2646 3.5826 3.5502 2.8522 4.6835 7.4077 4.3158 6.3752 3.4380 2.0479 3.3991 2.6980 3.1695 1.6589 2.2591 1.6694 2.1757 1.6061 1.3126 2.2009 3.6338 1.5255 2.3782 2.9035 2.6573 1.3636 1.3006 5.7953 2.5986 2.7584 2.0866 2.4189 2.6650 1.5581 2.7047 2.3666 2.1845 2.9748 2.1391 2.1747 1.7570 1.6793 1.0816 1.1723 1.2252 3.1567 1.6141 1.3955 1.1229 1.1190 1.2867 1.3409 1.4176 1.2941 1.2867 1.3322 1.5003 1.5149 4.5748 1.2318 1.2289 2.3519 1.0837 1.0949 1.0885 1.0454 1.0444 1.0924 1.5100 1.0528 1.0519 1.4424 6.3975 6.2237 8.7851 9.9949 1.0559 1.0361 1.0364 1.0634 1.0821 1.0833 1.0804 1.0597 1.0612 1.0988 1.1032 1.0974 1.0976 1.1030 1.1032 1.1061 1.1056 1.0846 1.0891 1.0927 1.0950 1.1002
irintensity: 0.2102 0.6955 0.7742 0.5025 0.1789 1.5395 0.6373 0.2553 0.1182 0.5447 5.7246 2.0414 1.0592 0.2620 7.5868 2.5621 0.8650 0.5985 1.4681 2.3442 8.5695 12.2783 9.7440 9.6742 0.1039 0.3570 1.2581 5.6161 12.1208 8.1103 11.0235 3.3018 0.4429 2.8931 33.9815 3.9532 12.4330 6.0920 87.1610 17.2516 8.0988 2.6729 5.3293 0.5560 0.6893 3.9450 7.9995 1.7706 34.1052 64.8715 0.1388 0.5808 1.2742 26.4831 61.3282 23.8632 18.4182 47.7548 13.8385 198.5670 54.4744 5.5286 126.2742 94.4191 167.6128 71.0996 18.7759 9.4563 50.8158 58.2055 147.2157 100.8312 56.1398 6.4866 3.3235 17.6373 3.3361 42.5030 23.5046 1.3832 6.8914 14.3210 0.7467 21.6542 21.9287 24.2652 1.8801 2.2901 14.2904 11.3001 14.8174 13.2062 27.9912 110.7288 10.5060 18.2819 16.5033 26.4151 88.0644 118.1905 184.8016 37.4418 19.9486 17.5506 12.2598 5.0349 50.4638 6.6621 57.9083 6.6791 1.2005 24.4209 34.5291 34.6040 0.8030 1.3840 30.7507 30.7661 3.0544 13.4500 35.0632 23.6104 4.7620
temp: 298.150 k
press: 1.00000 atm
elementType: 8 8 8 8 8 6 6 6 6 6 6 6 6 6 6 6 6 6 6 6 6 1 1 1 1 1 1 1 1 1 1 1 1 1 1 1 1 1 1 1 1 1 1
symmnumber: 1
zpe: 925784.3 jmol-1
zpe.correction: 0.352613 hartree
zpe.thermalcorrener: 0.375425 hartree
zpe.thermalcorrenthalpy: 0.376370 hartree
zpe.thermalcorrgfe: 0.294008 hartree
zpe.sumelectzpe: -997.410353 hartree
zpe.sumelectthermal: -997.387540 hartree
zpe.sumelectthermalent: -997.386596 hartree
zpe.sumelectthermalfe: -997.468957 hartree
dipole: 1.9043 0.8097 -0.6946
dipole: 2.1828
quadrupole: -108.5927 -112.0477 -128.9776
quadrupole: 2.1554 -2.4915 -1.8535
quadrupole: 7.9467 4.4916 -12.4383 2.1554 -2.4915 -1.8535
hfenergy: -997.7629651 hartree
pointgroup: C01 [X(C16H22O5)]
dipole: 0.794213 0.1979163 -0.25986 debye
polarizability: 240.1111513|-14.4555348|200.1753645|-1.7540158|4.0138511|123.0985036 unknown
InChI: InChI=1S/C16H22O5/c1-3-19-15(17)14(16(18)20-4-2)11-8-12-21-13-9-6-5-7-10-13/h5-7,9-10,14H,3-4,8,11-12H2,1-2H3
charge 0 multiplicity 1
43 atoms
O  -2.518093 0.563474 0.15108
O  2.356575 1.81238 -0.499084
O  3.475056 -1.648568 -1.624668
O  2.553344 -0.020171 0.935002
O  1.437042 -2.764738 -1.429332
C  -0.012126 -0.261699 -1.168075
C  1.536699 -0.280877 -1.318462
C  -0.545914 -0.844319 0.158946
C  -2.074065 -0.845071 0.208592
C  2.21653 0.466064 -0.167781
C  2.09769 -1.702389 -1.440774
C  -3.897619 0.820164 0.169294
C  2.952527 2.701626 0.549781
C  4.200413 -2.957113 -1.697147
C  -4.898654 -0.182035 0.239119
C  -4.261987 2.189801 0.112821
C  4.480722 2.678334 0.466693
C  4.522793 -3.46796 -0.290533
C  -6.260994 0.200207 0.25097
C  -5.6227 2.552936 0.125589
C  -6.632916 1.560952 0.194632
H  -0.360758 0.780509 -1.276204
H  -0.433297 -0.842277 -2.011504
H  1.802942 0.255468 -2.248311
H  -0.197996 -1.887227 0.272704
H  -0.161269 -0.270663 1.021729
H  -2.437944 -1.306041 1.149549
H  -2.501373 -1.40167 -0.652131
H  2.596966 2.362365 1.538553
H  2.535878 3.693319 0.312681
H  5.108545 -2.715138 -2.271674
H  3.573138 -3.673954 -2.255924
H  -4.635538 -1.242887 0.284181
H  -3.468562 2.942042 0.060633
H  4.904001 3.399925 1.189962
H  4.824914 2.958826 -0.543622
H  4.869794 1.675891 0.711331
H  5.134723 -4.38653 -0.360139
H  3.599362 -3.708374 0.261968
H  5.088888 -2.713423 0.281451
H  -7.032488 -0.576581 0.304791
H  -5.896932 3.613098 0.081647
H  -7.689919 1.846922 0.204367
