program: Gaussian 09
title: 000239006
version: EM64L-G09RevD.01
frameworkgroup: C1[X(C12H15NO3)]
method: RPBEPBE
basis: SDD
operation: Freq
keyword: #p
keyword: freq=noraman
keyword: PBEPBE/SDD
title: #p freq=noraman PBEPBE/SDD
converged: YES YES NO NO
title: Mulliken charges:
elementType: O O O N C C C C C C C C C C C C H H H H H H H H H H H H H H H
charge: -0.295596 -0.280655 -0.232674 -0.390922 -0.647520 0.407880 0.235877 -0.432457 -0.383640 -0.384995 -0.223772 -0.222916 0.243393 -0.241919 -0.252728 -0.660026 0.248160 0.248043 0.274150 0.273359 0.387033 0.239193 0.239445 0.228397 0.228639 0.229887 0.238931 0.226883 0.221246 0.229549 0.249756
chargesum: 0.00000
title: Mulliken charges with hydrogens summed into heavy atoms:
elementType: O O O N C C C C C C C C C C C C
charge: -0.295596 -0.280655 -0.232674 -0.003889 -0.151316 0.407880 0.235877 0.115052 -0.144447 -0.145550 0.004625 0.005723 0.243393 -0.012032 0.213085 0.040525
polarizability: 1.26154432e+02 -9.09699763e+00 1.73942125e+02 -2.46763348e+00 1.67365437e+00 1.18691619e+02
1716.lowfreq: -7.0482 -2.2137 -0.0010 -0.0008 -0.0003 7.0598 14.8155 19.2281 31.4384
frequency: 12.9885 17.7623 31.2005 41.1151 44.1254 63.4431 101.1706 112.8117 181.0656 194.7836 230.2443 235.8095 303.8788 321.8763 333.7893 401.3260 402.8599 436.0094 498.0436 542.8150 573.1628 577.7924 609.7214 617.4366 650.9844 661.2003 705.3158 754.5050 767.6932 818.3270 828.6845 857.1914 886.8625 920.4663 922.6065 941.4105 978.0722 979.4853 989.4445 996.0623 1016.7997 1027.3751 1081.8460 1097.5965 1114.9437 1156.4000 1171.7172 1177.4614 1189.0569 1194.1505 1210.3691 1213.2946 1230.8342 1279.2763 1286.8465 1325.6614 1327.2712 1357.5918 1380.6728 1393.3737 1439.4312 1446.8855 1457.3419 1461.5003 1464.6094 1480.1422 1484.2072 1484.4910 1590.7526 1603.7914 1615.0657 1654.2115 2990.0567 2994.2337 3009.1792 3028.4746 3034.4296 3063.1292 3089.7753 3096.0544 3120.0711 3121.3267 3122.6520 3135.0473 3147.1753 3164.2663 3529.7518
redmass: 3.6689 3.8455 3.6457 5.8532 4.5598 4.4292 3.7976 4.0787 2.5192 2.2065 1.7911 5.1731 2.7748 2.0511 6.9764 3.4232 2.8212 5.4348 4.0539 2.8672 4.2134 4.3785 4.7340 6.3740 1.1553 3.6327 1.7216 2.2700 2.1606 1.4997 3.6672 1.2476 3.3699 2.0275 1.5835 3.9060 1.9249 1.4425 6.2295 1.3125 3.1015 2.1928 1.5944 2.1952 6.5685 1.6674 1.0794 1.1152 1.1222 4.4679 1.0914 2.0924 1.9752 1.1424 1.5140 1.5182 1.2696 1.2828 8.1161 1.2314 2.1835 1.1558 1.0845 1.0826 1.0443 2.0512 1.0589 2.3011 6.0042 8.6598 6.4015 9.9151 1.0606 1.0361 1.0606 1.0989 1.0596 1.1002 1.0974 1.1030 1.0855 1.0882 1.1068 1.0915 1.0961 1.1016 1.0779
irintensity: 0.1085 1.9414 0.1125 5.6445 0.2872 1.4430 0.8073 2.5260 6.7068 0.3718 1.8911 9.2815 5.8872 1.1540 9.3692 7.8317 0.0291 5.6249 40.1159 1.3996 13.2269 10.0166 7.1961 0.1076 49.0494 1.3059 57.9881 44.7735 6.7333 1.8117 4.7086 0.0152 13.3934 2.2926 3.2395 32.5347 1.1672 0.3722 0.0021 0.1999 82.7012 6.7246 11.5819 20.9781 12.6243 19.0782 0.1358 0.1602 1.0339 221.5679 0.8676 12.0653 38.7304 4.8209 14.0680 2.5686 0.1653 1.3932 0.0202 25.6951 7.9114 101.5538 30.1699 4.6407 17.9316 298.7739 7.3186 20.5961 1.3320 287.9594 18.2202 181.4117 22.9653 14.9655 13.3774 4.5301 24.7113 4.0460 31.5582 1.5711 5.6871 2.0845 25.1698 11.1017 38.1142 18.8142 68.2882
temp: 298.150 k
press: 1.00000 atm
elementType: 8 8 8 7 6 6 6 6 6 6 6 6 6 6 6 6 1 1 1 1 1 1 1 1 1 1 1 1 1 1 1
symmnumber: 1
zpe: 655578.3 jmol-1
zpe.correction: 0.249697 hartree
zpe.thermalcorrener: 0.266036 hartree
zpe.thermalcorrenthalpy: 0.266980 hartree
zpe.thermalcorrgfe: 0.201200 hartree
zpe.sumelectzpe: -745.525008 hartree
zpe.sumelectthermal: -745.508669 hartree
zpe.sumelectthermalent: -745.507724 hartree
zpe.sumelectthermalfe: -745.573505 hartree
dipole: 1.1527 -5.6331 -0.3006
dipole: 5.7577
quadrupole: -102.7423 -101.7759 -87.2386
quadrupole: 4.9397 -1.4134 -1.2474
quadrupole: -5.4900 -4.5237 10.0137 4.9397 -1.4134 -1.2474
hfenergy: -745.7747042 hartree
pointgroup: C01 [X(C12H15N1O3)]
dipole: -1.101152 1.9712898 0.1810387 debye
polarizability: 134.7826468|-22.2440807|162.8762474|0.42001|6.5002918|121.1292823 unknown
InChI: InChI=1S/C12H15NO3/c1-2-16-12(15)9-13-11(14)8-10-6-4-3-5-7-10/h3-7,13H,2,8-9H2,1H3
charge 0 multiplicity 1
31 atoms
O  1.730051 1.223621 0.178324
O  0.862115 -3.456821 -0.742685
O  3.932072 0.547724 0.573038
N  0.829816 -1.165753 -0.399448
C  -1.298375 -2.313173 -0.997977
C  -1.967805 -0.953572 -0.90303
C  0.219889 -2.361564 -0.703236
C  2.26121 -1.11669 -0.103296
C  -2.505536 -0.492483 0.32797
C  -2.051681 -0.103422 -2.037464
C  -3.1103 0.781219 0.424072
C  -2.65552 1.171144 -1.945912
C  2.753417 0.277729 0.256855
C  -3.186833 1.61832 -0.713651
C  2.082876 2.637102 0.530809
C  1.940377 2.865076 2.037117
H  -1.760193 -3.033946 -0.298371
H  -1.420332 -2.746529 -2.007863
H  2.513804 -1.799809 0.730792
H  2.857317 -1.479612 -0.963989
H  0.301749 -0.289692 -0.372628
H  -2.454741 -1.139574 1.212432
H  -1.647463 -0.446603 -2.997886
H  -3.526323 1.116692 1.380828
H  -2.717103 1.810459 -2.833854
H  -3.661055 2.603586 -0.642654
H  3.113636 2.830637 0.18634
H  1.364576 3.234282 -0.052612
H  2.126911 3.929909 2.269562
H  0.923073 2.610372 2.38079
H  2.671874 2.259073 2.597331
