program: Gaussian 09
title: 000238993
version: EM64L-G09RevD.01
frameworkgroup: C1[X(C10H14N2O)]
method: RPBEPBE
basis: SDD
operation: Freq
keyword: #p
keyword: freq=noraman
keyword: PBEPBE/SDD
title: #p freq=noraman PBEPBE/SDD
converged: YES YES NO NO
title: Mulliken charges:
elementType: O N N C C C C C C C C C C H H H H H H H H H H H H H H
charge: -0.281525 -0.386472 -0.574289 -0.349482 -0.388511 -0.362124 0.167431 0.270167 -0.350213 -0.356434 -0.221662 -0.236245 -0.227712 0.188809 0.251236 0.205596 0.259078 0.204114 0.170955 0.300716 0.275079 0.215407 0.260897 0.273764 0.231754 0.228079 0.231585
chargesum: 0.00000
title: Mulliken charges with hydrogens summed into heavy atoms:
elementType: O N N C C C C C C C C C C
charge: -0.281525 -0.085756 -0.039628 0.090563 0.076163 0.012946 0.167431 0.270167 -0.075134 -0.141028 0.010092 -0.008166 0.003874
polarizability: 1.63771434e+02 1.44076022e+01 1.12938636e+02 -1.55732984e+01 1.63935697e+01 9.33899346e+01
1716.lowfreq: -5.3434 -0.0008 0.0004 0.0004 6.9039 13.3110 14.4957 39.5924 49.4850
frequency: 14.4331 39.4744 49.4492 66.5966 112.1032 144.5776 186.2576 224.9642 232.1140 304.9447 316.1231 388.3131 403.1706 413.9094 487.3774 526.2971 546.5795 569.8312 615.3386 654.0502 686.8714 702.6686 754.7078 791.4054 800.0572 854.8790 879.1273 906.2843 934.3422 983.3666 989.3823 1004.9327 1005.8835 1024.2241 1053.6782 1082.9560 1096.7824 1108.9947 1135.0490 1157.2214 1173.0144 1189.4432 1217.9316 1263.7895 1284.6289 1291.6884 1315.0289 1325.5549 1362.6489 1384.6269 1388.6789 1432.5927 1449.0108 1457.4348 1471.3444 1491.8000 1499.7834 1574.2757 1606.9818 1611.3787 1638.8420 2838.5317 2974.1489 2987.6549 3002.6260 3065.9475 3080.2606 3117.0871 3131.3249 3144.4444 3157.8209 3169.5072 3465.4968 3564.1642 3594.5588
redmass: 4.1794 5.1565 4.7915 1.7325 3.2956 4.1186 3.2473 3.4559 1.2663 2.6122 3.8558 3.6227 2.8090 3.9724 3.7608 1.7461 1.4293 1.4033 6.3275 5.4381 4.7227 1.5167 1.8419 2.3423 1.7442 1.2558 2.6045 2.0151 1.4439 1.4155 5.3391 1.4197 1.6645 2.3624 2.6952 1.6046 2.5141 2.6656 1.8010 2.0589 1.0584 1.1481 1.2856 2.0623 1.1271 1.3435 1.3304 1.3564 1.2952 9.3058 1.4665 2.1459 1.1502 1.0845 1.9490 1.1230 1.9545 6.3559 6.7475 6.1396 1.0950 1.0716 1.0670 1.0664 1.0843 1.0960 1.0983 1.0869 1.0870 1.0921 1.0957 1.1005 1.0448 1.0771 1.0982
irintensity: 1.2360 2.2011 4.2430 5.3425 0.8239 1.4239 1.2137 6.6708 39.0045 11.4289 8.2506 6.4643 1.3632 9.8893 9.3336 14.1642 203.7988 132.5127 0.9755 4.1858 10.8014 96.9915 10.3867 23.6907 3.8707 1.0188 2.8551 11.2672 2.9818 1.3204 0.5767 2.3516 2.4646 11.0965 5.9547 12.6605 15.5828 3.7527 14.8610 5.5321 0.7583 8.7961 8.8872 89.6697 33.7404 68.8674 1.6827 11.4437 2.6826 1.2224 10.8377 5.9066 40.8880 7.8552 88.9709 7.0736 181.7343 82.7653 71.0690 4.1340 42.0030 129.5012 23.5509 54.6302 59.8647 41.1670 8.8407 10.7846 2.2367 24.5676 17.2532 19.7607 0.8866 9.4684 0.8000
temp: 298.150 k
press: 1.00000 atm
elementType: 8 7 7 6 6 6 6 6 6 6 6 6 6 1 1 1 1 1 1 1 1 1 1 1 1 1 1
symmnumber: 1
zpe: 591988.6 jmol-1
zpe.correction: 0.225477 hartree
zpe.thermalcorrener: 0.238741 hartree
zpe.thermalcorrenthalpy: 0.239685 hartree
zpe.thermalcorrgfe: 0.183167 hartree
zpe.sumelectzpe: -573.217252 hartree
zpe.sumelectthermal: -573.203988 hartree
zpe.sumelectthermalent: -573.203044 hartree
zpe.sumelectthermalfe: -573.259562 hartree
dipole: 1.0528 -4.2337 -1.8569
dipole: 4.7414
quadrupole: -58.6958 -80.9703 -78.9981
quadrupole: 0.0368 -7.1036 2.8174
quadrupole: 14.1923 -8.0823 -6.1100 0.0368 -7.1036 2.8174
hfenergy: -573.442729 hartree
pointgroup: C01 [X(C10H14N2O1)]
dipole: 0.3632055 -1.5302254 -1.0031024 debye
polarizability: 164.8045643|14.9423638|105.8367676|-12.3186104|19.1255229|99.4586719 unknown
InChI: InChI=1S/C10H14N2O/c11-7-4-8-12-10(13)9-5-2-1-3-6-9/h1-3,5-6,12H,4,7-8,11H2
charge 0 multiplicity 1
27 atoms
O  0.197324 2.103484 0.50402
N  1.032966 0.343526 -0.768161
N  4.684302 -1.65691 0.884987
C  3.391045 0.323187 0.142671
C  2.385775 0.918585 -0.87078
C  3.673377 -1.1785 -0.074068
C  0.0140 0.987771 -0.080101
C  -1.324862 0.289315 -0.054935
C  -2.23243 0.658443 0.970372
C  -1.720742 -0.681089 -1.01311
C  -3.502503 0.051319 1.054058
C  -2.995081 -1.285137 -0.932546
C  -3.88639 -0.925815 0.105023
H  4.342095 0.888251 0.047971
H  3.024351 0.478423 1.172838
H  2.754893 0.773633 -1.905674
H  2.277474 2.001252 -0.688705
H  2.742936 -1.753029 0.104529
H  3.952274 -1.336119 -1.148567
H  0.874382 -0.599868 -1.122247
H  -1.918348 1.428957 1.682044
H  -1.062731 -0.943485 -1.850822
H  5.581311 -1.165199 0.830838
H  4.798553 -2.673013 0.928379
H  -4.193602 0.339277 1.853798
H  -3.29633 -2.024977 -1.682427
H  -4.874338 -1.395683 0.166818
