program: Gaussian 09
title: 000238981
version: EM64L-G09RevD.01
frameworkgroup: C1[X(C12H14ClNO2S2)]
method: RPBEPBE
basis: SDD
operation: Freq
keyword: #p
keyword: freq=noraman
keyword: PBEPBE/SDD
title: #p freq=noraman PBEPBE/SDD
converged: YES YES NO NO
title: Mulliken charges:
elementType: Cl S S O O N C C C C C C C C C C C C H H H H H H H H H H H H H H
charge: -0.058263 0.186941 0.115266 -0.215170 -0.177533 -0.405904 -0.347105 -0.619278 -0.657826 -0.720274 0.508494 0.044866 -0.410305 -0.355257 -0.046619 -0.189663 -0.251329 -0.061160 0.279585 0.219863 0.216235 0.230007 0.221944 0.242109 0.223393 0.302700 0.275733 0.270420 0.297084 0.386009 0.235339 0.259696
chargesum: 0.00000
title: Mulliken charges with hydrogens summed into heavy atoms:
elementType: Cl S S O O N C C C C C C C C C C C C
charge: -0.058263 0.186941 0.115266 -0.215170 -0.177533 -0.019895 -0.067520 0.046827 0.029621 -0.141841 0.508494 0.044866 -0.139885 -0.058172 -0.046619 0.045676 0.008367 -0.061160
polarizability: 2.91780610e+02 -7.11887230e+00 2.01510743e+02 7.94370400e+00 1.12926491e+01 1.16884984e+02
1716.lowfreq: -17.1962 -3.7340 -0.0030 -0.0021 0.0016 0.2819 11.0331 23.7078 30.8884
frequency: -12.1612 23.6425 30.4333 48.9693 53.7390 64.5375 86.3802 97.3534 147.2315 163.4524 184.8712 198.3432 208.4384 223.1750 243.9318 251.8248 264.8306 305.0885 321.1567 326.8356 369.7893 388.0262 408.4409 412.9180 439.0733 460.7621 529.7489 559.3100 567.4511 572.8379 610.2141 619.8352 664.9258 677.1550 686.2437 791.1469 794.1215 852.6818 868.3931 875.4788 889.2147 909.4672 928.9211 937.8328 950.1618 979.8838 986.2985 1018.2832 1057.7935 1075.4600 1096.6030 1128.4821 1132.8598 1162.0849 1182.9983 1186.2176 1211.6101 1250.7242 1254.5669 1304.1604 1319.8502 1376.1505 1383.6332 1400.0624 1420.0971 1423.9613 1462.1278 1462.8370 1470.8840 1475.1660 1483.2921 1552.1487 1569.5539 1607.2340 1638.7256 1719.9924 2977.2415 2983.6449 3022.9396 3044.6169 3066.0457 3076.6321 3090.2469 3096.7342 3118.9376 3128.2778 3149.3714 3154.5615 3179.6236 3196.3174
redmass: 4.4790 5.3185 4.3015 4.8219 6.6826 7.2149 10.0555 8.3828 7.4116 5.6392 5.3719 4.7692 1.0577 6.6702 1.6038 2.4438 4.8135 3.9430 3.4541 3.9350 6.0552 6.3349 2.5523 7.2332 3.0858 12.9581 5.6949 5.6753 3.6864 8.6734 7.4663 7.4528 7.5861 6.7034 2.2887 1.3509 7.5713 6.0079 1.4531 2.5014 2.0060 1.3633 1.1895 1.1528 1.3703 6.0206 1.3244 2.7703 1.3976 2.2211 1.5852 3.6757 2.5465 1.9197 1.0895 1.3391 1.1761 1.3110 2.0399 1.5064 1.3802 6.9827 1.2122 1.2024 1.0996 2.9572 1.0465 1.0471 2.5647 1.0434 1.0483 3.7995 6.8172 6.0186 2.0148 5.3073 1.0363 1.0358 1.0865 1.0571 1.0978 1.0992 1.1001 1.0998 1.0892 1.1069 1.0888 1.0933 1.0953 1.0959
irintensity: 0.6480 0.2585 0.4776 1.4890 0.6612 1.0095 0.8720 4.0617 3.5320 7.8151 0.7364 0.3930 0.0128 8.1149 0.5130 0.4095 1.7599 1.9363 0.3691 1.5680 0.3163 9.5861 0.7500 13.0950 6.9147 18.5150 57.3256 0.9432 7.6716 44.1846 54.1063 64.2936 35.0880 1.0932 23.4275 59.6917 101.9378 31.5641 3.9179 1.2325 2.7251 0.6251 1.2749 111.6889 0.0850 7.4478 2.9165 115.6716 39.6679 23.8444 52.9251 169.9896 3.8368 28.0707 0.6416 57.0191 4.8334 23.0952 53.4030 37.5813 3.1512 25.0049 24.0027 16.7538 23.2907 30.6811 9.7563 2.3745 143.2970 17.4272 13.0467 374.0499 105.0787 197.0642 135.2302 276.5161 27.0403 27.6619 1.8066 8.6587 25.0778 21.6548 23.0934 32.9088 418.5205 17.7675 8.3923 1.2156 3.3255 1.6897
temp: 298.150 k
press: 1.00000 atm
elementType: 17 16 16 8 8 7 6 6 6 6 6 6 6 6 6 6 6 6 1 1 1 1 1 1 1 1 1 1 1 1 1 1
symmnumber: 1
zpe: 622580.4 jmol-1
zpe.correction: 0.237128 hartree
zpe.thermalcorrener: 0.256062 hartree
zpe.thermalcorrenthalpy: 0.257006 hartree
zpe.thermalcorrgfe: 0.187561 hartree
zpe.sumelectzpe: -1925.740405 hartree
zpe.sumelectthermal: -1925.721471 hartree
zpe.sumelectthermalent: -1925.720526 hartree
zpe.sumelectthermalfe: -1925.789972 hartree
dipole: -3.0377 0.5316 -0.1622
dipole: 3.0881
quadrupole: -110.1001 -140.0438 -126.4478
quadrupole: 5.7281 2.8297 4.2861
quadrupole: 15.4305 -14.5132 -0.9173 5.7281 2.8297 4.2861
hfenergy: -1925.9775329 hartree
pointgroup: C01 [X(C12H14Cl1N1O2S2)]
dipole: -1.1415994 -0.1657585 0.3812778 debye
polarizability: 286.4307618|2.0112109|156.2876111|-25.3940166|-45.15995|167.4579641 unknown
InChI: InChI=1S/C12H14ClNO2S2/c1-8(2)17-7-11(15)18-12(16)14-10-5-3-4-9(13)6-10/h3-6,8,14H,7H2,1-2H3
charge 0 multiplicity 1
32 atoms
Cl 4.428979 1.868198 -2.731255
S  -4.571407 0.691052 -0.89398
S  -1.834858 0.186028 1.732679
O  -1.331672 1.887992 -0.388868
O  0.455011 -1.19725 2.330622
N  0.693776 0.33132 0.534581
C  -5.1013 -0.775183 0.233754
C  -6.236789 -0.366494 1.185047
C  -5.499253 -1.915621 -0.720908
C  -3.663339 1.814202 0.344667
C  2.060544 0.161693 0.156311
C  -2.203017 1.429526 0.400554
C  2.515859 0.961307 -0.926956
C  2.945463 -0.742088 0.800173
C  3.850996 0.838098 -1.341485
C  4.279671 -0.833789 0.349727
C  4.755076 -0.048301 -0.724964
C  0.042974 -0.331505 1.535976
H  -4.194155 -1.057015 0.79912
H  -6.504571 -1.220248 1.837211
H  -5.951017 0.473358 1.843992
H  -7.13513 -0.066946 0.617036
H  -5.814836 -2.795859 -0.130811
H  -4.65638 -2.215037 -1.366983
H  -6.347424 -1.620623 -1.366067
H  -3.759391 2.836587 -0.05352
H  -4.15732 1.739354 1.32589
H  1.839484 1.659719 -1.430372
H  2.593306 -1.354909 1.631731
H  0.130903 1.027939 -0.00437
H  4.964321 -1.530384 0.844731
H  5.789397 -0.122422 -1.070365
