program: Gaussian 09
title: 000238952
version: EM64L-G09RevD.01
frameworkgroup: C1[X(C13H12O3)]
method: RPBEPBE
basis: SDD
operation: Freq
keyword: #pfreq=noraman
keyword: PBEPBE/SDD
title: #p freq=noraman PBEPBE/SDD
converged: NO NO NO NO
title: Mulliken charges:
elementType: O O O C C C C C C C C C C C C C H H H H H H H H H H H H
charge: -0.254773 -0.272204 -0.202325 0.232043 0.205980 0.404978 -0.353914 -0.504531 0.375827 -0.415098 -0.483755 -0.809859 0.126178 -0.313148 -0.112536 -0.545160 0.246419 0.283988 0.256377 0.253060 0.240449 0.240520 0.240974 0.233528 0.233448 0.248886 0.227130 0.217518
chargesum: 0.00000
title: Mulliken charges with hydrogens summed into heavy atoms:
elementType: O O O C C C C C C C C C C C C C
charge: -0.254773 -0.272204 -0.202325 0.232043 0.205980 0.404978 -0.107495 -0.220543 0.375827 -0.158721 -0.230695 -0.087916 0.126178 0.153829 0.136350 -0.100512
polarizability: 2.53654532e+02 1.11720191e+01 1.69841460e+02 1.53800769e-02 2.39605694e-02 6.79328666e+01
1716.lowfreq: -102.1017 -10.1272 -5.2997 -0.0010 -0.0007 -0.0002 5.9172 38.8536 76.4416
frequency: -102.0981 38.8270 76.4414 86.4626 110.7626 132.6299 161.2306 202.3513 213.0108 243.5318 251.5738 290.1806 326.2673 347.5580 419.9249 450.5875 467.6599 504.3999 516.9361 544.9628 558.3615 562.5975 627.5270 659.8915 669.7127 705.7373 743.0294 766.6983 781.2153 818.8753 852.6611 871.9293 903.1843 939.2042 954.3718 955.7587 984.1692 994.3855 998.1299 1012.0026 1046.0624 1053.4034 1113.2591 1132.6443 1141.7955 1173.1574 1192.6441 1232.0558 1251.4394 1273.5024 1281.4442 1337.7362 1384.4921 1385.3508 1402.0173 1429.1661 1434.9694 1464.7033 1466.8096 1468.9958 1503.7449 1548.5637 1606.3047 1619.5442 1663.0579 1691.4724 2950.9858 2982.1802 3007.6398 3058.9652 3094.9553 3104.0021 3131.6737 3150.7531 3172.1208 3178.4075 3182.4437 3206.8330
redmass: 1.9101 4.5968 4.5986 3.5226 4.5091 2.7311 1.3576 2.1104 4.2031 4.0632 6.9368 5.1279 4.4401 3.8885 7.4690 2.9944 5.1852 5.5760 5.5661 3.1110 1.5408 4.6935 3.9656 7.3144 3.6934 6.0467 3.2435 7.1290 6.7407 1.5069 1.6690 1.3841 2.0425 1.3175 3.7467 1.3272 1.0898 2.0046 2.8532 1.6246 1.5747 4.3382 2.7996 1.8769 1.9426 2.1871 1.0595 2.1046 1.8094 1.3879 1.5105 1.3344 3.8286 2.5950 1.4166 1.2440 4.7045 1.1283 1.0453 1.1089 3.3663 7.1061 7.4292 6.9701 4.9479 10.4698 1.0554 1.0382 1.1061 1.0970 1.0615 1.0986 1.0941 1.0883 1.0918 1.0960 1.0921 1.1140
irintensity: 2.5320 1.5757 1.7422 3.3257 0.3214 3.2335 0.0153 1.2803 0.4247 0.5028 0.7407 7.0576 0.4243 1.6699 1.5613 5.3853 11.6429 16.5131 1.9752 0.5334 20.1482 2.0428 3.9460 1.3567 6.0877 0.6959 1.0067 22.5811 37.4187 23.0771 41.7251 38.4697 9.5847 75.0268 29.9373 0.0597 27.2489 7.0141 99.5791 7.4951 8.5948 84.5555 56.0263 51.3888 6.1513 73.0112 0.9266 45.3282 114.1245 30.1877 71.1959 27.2873 43.2560 94.3500 78.6485 9.4343 35.6387 27.4993 16.9040 10.6069 8.2411 16.1314 12.7747 521.8399 10.5507 515.3144 16.6599 12.7474 28.5405 12.8755 7.7324 21.2079 2.9379 5.9942 1.8117 4.6710 3.6369 20.8942
temp: 298.150 k
press: 1.00000 atm
elementType: 8 8 8 6 6 6 6 6 6 6 6 6 6 6 6 6 1 1 1 1 1 1 1 1 1 1 1 1
symmnumber: 1
zpe: 563824.1 jmol-1
zpe.correction: 0.214749 hartree
zpe.thermalcorrener: 0.228665 hartree
zpe.thermalcorrenthalpy: 0.229609 hartree
zpe.thermalcorrgfe: 0.173611 hartree
zpe.sumelectzpe: -727.083897 hartree
zpe.sumelectthermal: -727.069982 hartree
zpe.sumelectthermalent: -727.069037 hartree
zpe.sumelectthermalfe: -727.125035 hartree
dipole: -2.1937 -4.5416 0.0058
dipole: 5.0437
quadrupole: -83.2985 -99.0117 -96.9391
quadrupole: -22.9551 0.0037 0.0105
quadrupole: 9.7846 -5.9286 -3.8560 -22.9551 0.0037 0.0105
hfenergy: -727.2986461 hartree
pointgroup: C01 [X(C13H12O3)]
dipole: 0.94681 -1.7427074 0.0638962 debye
polarizability: 254.4671122|-7.2922417|168.7511901|-2.9653758|-4.6984765|68.2105566 unknown
InChI: InChI=1S/C13H12O3/c1-3-6-15-10-4-5-11-9(2)7-13(14)16-12(11)8-10/h3-5,7-8H,1,6H2,2H3
charge 0 multiplicity 1
28 atoms
O  -1.469408 1.566019 -0.186313
O  2.83636 -0.68505 -0.155303
O  -3.489559 2.686153 -0.204056
C  -1.39942 -0.896372 -0.070649
C  -0.748591 0.371942 -0.142361
C  -2.855766 -0.931797 -0.044115
C  -0.567145 -2.05564 -0.029626
C  0.655802 0.499104 -0.173357
C  1.442378 -0.672634 -0.131243
C  0.826388 -1.956178 -0.058788
C  -3.562285 0.258427 -0.088338
C  -3.584328 -2.2563 0.030114
C  -2.93796 1.570147 -0.160729
C  3.537788 0.613142 -0.232117
C  5.017723 0.301772 -0.242969
C  5.99881 1.233321 -0.306807
H  -1.029185 -3.046118 0.026287
H  1.080766 1.503761 -0.229226
H  1.466923 -2.841663 -0.027422
H  -4.655514 0.266332 -0.070254
H  -3.303252 -2.815486 0.942329
H  -3.333278 -2.898012 -0.835326
H  -4.675688 -2.107605 0.041674
H  3.224345 1.145214 -1.154087
H  3.256606 1.234484 0.643274
H  5.261005 -0.76731 -0.1940
H  7.053125 0.939928 -0.310966
H  5.784756 2.308317 -0.356627
