program: Gaussian 09
title: 000238950
version: EM64L-G09RevD.01
frameworkgroup: C1[X(C13H9NO4S)]
method: RPBEPBE
basis: SDD
operation: Freq
keyword: #p
keyword: freq=noraman
keyword: PBEPBE/SDD
title: #p freq=noraman PBEPBE/SDD
converged: YES YES NO NO
title: Mulliken charges:
elementType: S O O O O N C C C C C C C C C C C C C H H H H H H H H H
charge: 0.367279 -0.437050 -0.236083 -0.210832 -0.205671 0.017355 -0.456913 0.355956 -0.457563 0.419737 -0.054986 -0.404848 -0.252043 -0.227306 -0.222561 0.119666 -0.210776 -0.211750 -0.223162 0.333000 0.271910 0.292309 0.263048 0.263457 0.238306 0.238358 0.237114 0.394050
chargesum: 0.00000
title: Mulliken charges with hydrogens summed into heavy atoms:
elementType: S O O O O N C C C C C C C C C C C C C
charge: 0.367279 -0.043000 -0.236083 -0.210832 -0.205671 0.017355 -0.456913 0.355956 -0.124563 0.419737 0.216924 -0.112539 -0.252043 0.035742 0.040896 0.119666 0.027530 0.026608 0.013952
polarizability: 2.87134712e+02 -4.46438313e+00 1.99137183e+02 -1.59704480e+00 -3.72241583e-01 1.08386063e+02
1716.lowfreq: -9.3199 -5.6876 -1.0253 -0.0016 -0.0013 -0.0013 18.5076 33.4174 51.8706
frequency: 18.3330 33.3756 51.8625 54.8736 72.6014 89.9858 144.6616 154.0669 158.4727 210.2907 267.6091 286.5216 289.1451 315.4889 343.5488 401.3446 412.5694 431.2047 451.6193 496.4960 500.0520 529.6945 573.7800 583.8480 609.5980 612.0657 665.6479 672.5735 674.6518 697.8407 718.8448 734.9844 761.2581 772.5549 849.5087 859.1141 867.7157 932.1781 975.1693 981.0861 984.7722 1002.0681 1002.1401 1003.0104 1013.2078 1043.8132 1072.5360 1073.3022 1099.2151 1139.0358 1158.6302 1174.4511 1183.4648 1213.8679 1255.7489 1302.1879 1317.0729 1362.9627 1373.3299 1397.2075 1404.2909 1425.9654 1449.9025 1458.8181 1565.2816 1586.1898 1587.2000 1599.6760 1629.8935 3133.6171 3142.1492 3152.8068 3161.5460 3166.7530 3172.9941 3185.7275 3195.0218 3538.2621
redmass: 5.3386 4.7183 6.4728 13.0566 10.7313 8.5352 9.0857 4.8484 8.5852 5.5836 6.1472 7.3043 8.0445 11.2403 12.6660 2.8148 11.5246 3.0576 5.4522 3.9727 6.3022 5.4723 6.1462 1.2665 6.4810 5.4178 5.7952 6.8855 6.8982 2.1696 5.3469 9.1378 1.5641 5.4390 1.3364 1.3044 7.7550 1.3665 1.4830 1.3901 6.4244 4.1744 1.3746 1.3512 3.6139 4.4765 1.6094 2.4234 1.7072 2.3350 1.4861 1.0546 1.1192 6.7605 1.4763 1.3155 2.5063 8.6354 9.8119 11.1955 4.2108 2.0711 2.7903 2.0885 7.7884 5.9913 6.2849 7.3996 8.8035 1.0852 1.0884 1.0929 1.0971 1.0883 1.1017 1.0963 1.0922 1.0644
irintensity: 0.0039 0.5622 0.5485 0.3784 2.0536 0.7436 6.0706 0.0097 0.5215 0.4922 3.1836 1.9744 0.2288 3.6284 8.4093 0.0465 9.2059 12.2464 10.8936 0.4643 13.0755 4.3500 23.5123 120.5502 0.0800 59.9765 56.1452 2.7101 3.2995 44.8366 1.2598 7.4394 69.3976 7.2452 12.4758 7.4871 28.4648 2.2899 19.7531 0.0578 26.2606 240.5231 6.6450 8.8378 6.2327 77.2649 7.8263 3.8444 52.2143 39.7870 54.2367 0.0013 14.4147 558.7584 18.4432 1.0378 81.4601 149.6650 1.4728 1.6934 27.2983 11.5984 64.6986 15.3136 44.1756 8.3902 1.4874 56.3727 293.1863 0.2167 3.1220 10.8583 17.8439 3.4038 20.3019 0.7190 13.4877 74.4291
temp: 298.150 k
press: 1.00000 atm
elementType: 16 8 8 8 8 7 6 6 6 6 6 6 6 6 6 6 6 6 6 1 1 1 1 1 1 1 1 1
symmnumber: 1
zpe: 508319.3 jmol-1
zpe.correction: 0.193609 hartree
zpe.thermalcorrener: 0.210110 hartree
zpe.thermalcorrenthalpy: 0.211054 hartree
zpe.thermalcorrgfe: 0.146761 hartree
zpe.sumelectzpe: -1253.084733 hartree
zpe.sumelectthermal: -1253.068231 hartree
zpe.sumelectthermalent: -1253.067287 hartree
zpe.sumelectthermalfe: -1253.131581 hartree
dipole: 5.4043 0.5867 0.0259
dipole: 5.4361
quadrupole: -121.0527 -122.2074 -109.3213
quadrupole: -28.9352 -0.1566 0.0403
quadrupole: -3.5256 -4.6803 8.2058 -28.9352 -0.1566 0.0403
hfenergy: -1253.2783412 hartree
pointgroup: C01 [X(C13H9N1O4S1)]
dipole: 2.1216366 0.2534528 0.0924476 debye
polarizability: 280.2907964|21.866243|198.8573299|10.4142183|25.2177763|115.5098327 unknown
InChI: InChI=1S/C13H9NO4S/c15-13(16)11-8-9(14(17)18)6-7-12(11)19-10-4-2-1-3-5-10/h1-8,15H
charge 0 multiplicity 1
28 atoms
S  1.697774 -1.353195 -0.236667
O  -2.215679 -3.553215 -0.982511
O  0.101898 -3.533063 -0.880342
O  -4.095255 2.170556 0.634379
O  -4.97503 0.153774 0.022705
N  -3.976179 0.932707 0.277851
C  0.003392 -0.67364 -0.079647
C  -1.141635 -1.500833 -0.346892
C  -2.444036 -0.959359 -0.226763
C  -2.612214 0.380322 0.155822
C  -0.209131 0.678107 0.307089
C  -1.499665 1.210066 0.42724
C  2.726023 0.140799 0.16537
C  3.184888 0.334386 1.488473
C  3.136058 1.004952 -0.875926
C  -0.987696 -2.921284 -0.749722
C  4.052804 1.414849 1.773188
C  4.00291 2.083981 -0.584336
C  4.460193 2.289716 0.738775
H  -3.314193 -1.586428 -0.43251
H  0.651343 1.3183 0.515974
H  -1.662818 2.248998 0.725775
H  2.869562 -0.351611 2.281421
H  2.783991 0.832939 -1.898293
H  4.410387 1.567758 2.797045
H  4.322146 2.755804 -1.388262
H  5.134873 3.123632 0.961257
H  -2.048813 -4.49712 -1.246594
