program: Gaussian 09
title: 000238976
version: EM64L-G09RevD.01
frameworkgroup: C1[X(C11H12N2O8S)]
method: RPBEPBE
basis: SDD
operation: Freq
keyword: #p
keyword: freq=noraman
keyword: PBEPBE/SDD
title: #p freq=noraman PBEPBE/SDD
converged: YES YES NO NO
title: Mulliken charges:
elementType: S O O O O O O O O N N C C C C C C C C C C C H H H H H H H H H H H H
charge: 0.922586 -0.516076 -0.516186 -0.394663 -0.235101 -0.410602 -0.233358 -0.191721 -0.191782 -0.565043 0.028298 -0.180145 -0.411402 -0.514618 -0.007761 0.179826 -0.227933 -0.198552 0.188143 -0.326326 -0.329335 0.396824 0.315327 0.276015 0.267322 0.344028 0.271619 0.297143 0.300378 0.290204 0.300718 0.300041 0.391319 0.380811
chargesum: 0.00000
title: Mulliken charges with hydrogens summed into heavy atoms:
elementType: S O O O O O O O O N N C C C C C C C C C C C
charge: 0.922586 -0.516076 -0.516186 -0.003344 -0.235101 -0.029791 -0.233358 -0.191721 -0.191782 -0.221015 0.028298 0.135182 0.131935 0.054144 -0.007761 0.179826 0.072445 0.091652 0.188143 -0.025608 -0.029293 0.396824
polarizability: 2.65066038e+02 -2.79634261e+00 1.66156746e+02 1.78487483e+01 2.73874404e+01 1.43566385e+02
1716.lowfreq: -11.5809 -4.8417 -1.3778 -0.0012 -0.0009 0.0007 11.0270 15.5697 25.0317
frequency: 7.6672 15.3458 24.9901 29.3271 38.8913 40.6156 64.3325 67.9851 90.5972 97.3580 121.7724 131.5574 142.6395 177.2636 202.1831 212.9659 226.7575 243.4008 273.7420 283.0374 338.8080 361.2691 376.1379 404.4988 410.7073 427.4107 456.2708 482.1547 502.8961 504.9698 507.8054 555.8116 577.8698 598.3763 612.1232 633.8849 643.1392 660.9741 681.4143 726.9265 734.8136 741.7965 780.7312 792.1734 809.4955 850.8420 855.9105 873.0978 887.1887 908.8048 940.4473 991.1191 993.1378 1001.9101 1030.2714 1045.0967 1047.6001 1060.3124 1085.7713 1092.0044 1098.7923 1105.6305 1171.0367 1173.1979 1216.2312 1226.6444 1231.9240 1259.1573 1277.8657 1281.9826 1303.1425 1344.7110 1371.6890 1381.3601 1387.5987 1391.7283 1423.7151 1452.1843 1455.4298 1477.8034 1581.4174 1608.2082 1644.2150 1665.9261 2983.8192 3013.4508 3042.1407 3075.8648 3080.3746 3160.6854 3167.8721 3188.9151 3191.5198 3374.2530 3510.1568 3516.2295
redmass: 9.0476 10.8819 6.4847 10.5407 8.6308 8.1447 7.1063 6.3396 7.6388 5.9761 4.6537 6.5327 4.9269 5.9709 12.8445 8.5046 7.9332 4.7693 3.6695 5.8013 7.1215 4.7421 10.7894 9.0451 2.9215 4.5754 4.3728 6.2368 3.4278 6.0024 2.2377 3.8272 2.8592 2.5346 7.0994 1.5521 1.4193 4.8786 8.4707 5.4060 4.2192 2.3653 5.3185 2.4979 5.8292 1.3007 2.4009 1.5341 4.0703 3.0632 11.4270 1.3851 5.0370 1.3718 2.8429 2.3859 2.4529 2.2761 4.1559 4.2139 2.3364 1.3008 1.2325 1.1476 8.7753 1.1885 1.3986 1.5441 1.1418 1.2468 1.7226 1.5581 6.1591 1.4551 1.6787 5.7303 7.0293 2.1529 1.0842 1.0812 6.1898 8.3943 8.6117 8.0550 1.0623 1.0607 1.0981 1.1022 1.0861 1.0910 1.0907 1.0951 1.0966 1.0748 1.0641 1.0640
irintensity: 0.1216 1.3156 0.1144 0.0421 0.4498 1.0711 0.9478 2.1769 10.1564 4.4450 4.5910 0.1884 1.5968 1.2875 9.7452 10.6342 1.6702 4.0586 3.8348 2.5684 0.9814 21.0923 20.3065 73.7979 1.6563 31.2319 12.9848 58.4772 32.1663 2.0982 90.6935 14.4797 82.0564 79.5289 0.0435 51.8162 113.5415 26.0646 21.1894 15.6434 7.1514 188.7078 53.5763 21.7279 30.2836 6.6876 8.5819 44.7420 3.1884 13.5457 66.4827 4.6442 6.4284 0.5489 198.4468 137.5783 135.2747 141.5785 3.8887 15.5860 74.4958 16.9516 10.2603 13.8008 263.1931 24.4166 3.6361 6.7978 5.5840 0.2297 62.7657 78.4842 46.2958 42.7105 23.9105 66.8767 46.6344 11.4385 20.8267 28.5081 25.0206 0.3861 158.3879 232.7872 11.8052 4.7462 3.8434 6.2853 4.1331 5.9442 3.3673 3.8730 1.6715 40.5743 43.1838 26.5225
temp: 298.150 k
press: 1.00000 atm
elementType: 16 8 8 8 8 8 8 8 8 7 7 6 6 6 6 6 6 6 6 6 6 6 1 1 1 1 1 1 1 1 1 1 1 1
symmnumber: 1
zpe: 611981.2 jmol-1
zpe.correction: 0.233091 hartree
zpe.thermalcorrener: 0.255701 hartree
zpe.thermalcorrenthalpy: 0.256645 hartree
zpe.thermalcorrgfe: 0.175241 hartree
zpe.sumelectzpe: -1533.832208 hartree
zpe.sumelectthermal: -1533.809598 hartree
zpe.sumelectthermalent: -1533.808654 hartree
zpe.sumelectthermalfe: -1533.890059 hartree
dipole: 2.1352 1.9672 -1.8619
dipole: 3.4490
quadrupole: -162.4136 -125.8065 -145.0793
quadrupole: 5.6802 -14.7595 4.7422
quadrupole: -17.9805 18.6266 -0.6462 5.6802 -14.7595 4.7422
hfenergy: -1534.0652995 hartree
pointgroup: C01 [X(C11H12N2O8S1)]
dipole: 0.7149071 -1.1245074 0.2562179 debye
polarizability: 264.9981946|-4.1492313|137.5088447|-14.2181082|26.2651379|172.2821288 unknown
InChI: InChI=1S/C11H12N2O8S/c14-10(15)6-5-9(11(16)17)12-22(20,21)8-3-1-7(2-4-8)13(18)19/h1-4,9,12,14,16H,5-6H2
charge 0 multiplicity 1
34 atoms
S  0.296409 0.944122 -0.483328
O  0.518248 1.215574 -2.070633
O  0.909481 1.946729 0.650986
O  2.900095 -3.379044 -1.553309
O  2.173887 -3.051555 0.63174
O  5.443986 0.880115 2.028222
O  6.013958 0.46158 -0.182487
O  -6.137784 0.919848 1.773504
O  -6.457155 0.016449 -0.297265
N  0.834046 -0.795748 -0.221632
N  -5.708965 0.509189 0.629496
C  2.041712 -1.19854 -0.999662
C  3.315371 -0.307068 -0.834812
C  3.725496 -0.048947 0.629607
C  -1.55596 0.784237 -0.134151
C  2.344849 -2.62109 -0.531554
C  -2.02544 1.240235 1.107882
C  -2.375351 0.257936 -1.146394
C  5.157661 0.442281 0.728682
C  -3.4103 1.148811 1.361715
C  -3.758737 0.168263 -0.8911
C  -4.245246 0.609284 0.359849
H  1.771985 -1.224726 -2.06712
H  3.116412 0.652268 -1.346386
H  4.147588 -0.784489 -1.383441
H  0.92988 -0.974203 0.796376
H  3.65347 -0.96671 1.247881
H  3.071291 0.703794 1.107908
H  -1.332665 1.672511 1.836857
H  -1.949691 -0.056216 -2.103912
H  -3.845886 1.484847 2.305886
H  -4.455949 -0.231424 -1.631484
H  3.148995 -4.282084 -1.214099
H  6.39131 1.184272 2.070978
