program: Gaussian 09
title: 000238943
version: EM64L-G09RevD.01
frameworkgroup: C1[X(C9H12N4O3)]
method: RPBEPBE
basis: SDD
operation: Freq
keyword: #p
keyword: freq=noraman
keyword: PBEPBE/SDD
title: #p freq=noraman PBEPBE/SDD
converged: YES YES NO NO
title: Mulliken charges:
elementType: O O O N N N N C C C C C C C C C H H H H H H H H H H H H
charge: -0.501191 -0.298276 -0.298362 -0.373795 -0.373298 -0.651681 -0.651645 -0.308752 0.455709 0.164962 -0.396489 -0.383712 -0.243670 -0.212289 0.272831 0.272933 0.317018 0.319111 0.318877 0.257916 0.216723 0.231972 0.229856 0.363769 0.297388 0.338360 0.338336 0.297400
chargesum: 0.00000
title: Mulliken charges with hydrogens summed into heavy atoms:
elementType: O O O N N N N C C C C C C C C C
charge: -0.137422 -0.298276 -0.298362 -0.054684 -0.054421 -0.015933 -0.015909 0.008266 0.455709 0.164962 -0.138573 -0.166989 -0.011698 0.017567 0.272831 0.272933
polarizability: 1.49833528e+02 4.53563528e-02 1.12036161e+02 -6.07454081e-01 -1.26958731e-01 1.39471951e+02
1716.lowfreq: -20.5750 -7.1536 0.0003 0.0005 0.0005 5.5507 7.4952 35.1527 45.6112
frequency: -20.3002 35.1302 45.5986 59.0969 68.8463 96.0461 139.8009 200.8329 203.0259 230.7236 293.1720 301.3212 314.4689 325.6851 352.4001 373.6652 415.6426 447.3912 467.4920 478.2677 501.1688 508.2767 526.0248 557.4181 573.2137 580.0823 615.1023 648.6596 655.5524 711.2143 716.2528 745.0693 752.8982 760.7541 846.1778 871.1895 921.7110 941.4708 977.4515 979.1214 1034.9804 1037.1312 1038.1346 1080.6340 1116.7790 1117.5773 1154.6663 1173.1073 1210.7864 1222.9398 1263.5990 1270.9257 1318.4068 1333.5928 1365.5288 1398.9122 1444.1782 1451.8904 1488.3844 1511.8160 1597.4038 1599.6117 1602.0555 1619.6907 1647.3153 1657.8418 3059.5873 3112.2880 3139.2523 3151.4805 3170.1855 3537.6422 3538.2795 3545.4547 3546.3314 3589.5108 3700.7288 3700.7784
redmass: 7.2420 7.4951 5.1125 4.3716 4.2844 5.7399 5.2619 4.0236 8.0599 6.0036 1.3122 2.4594 1.5511 2.7289 4.2643 1.1829 4.3029 2.9653 1.1691 1.2396 3.1986 2.3640 1.2141 4.0075 3.3602 6.1776 1.7456 3.5494 4.4147 8.7271 8.2176 3.6392 1.3004 5.1934 1.4350 5.4507 2.6559 1.6429 2.4438 1.3386 2.4968 2.5220 1.9121 2.2310 3.6955 3.8011 1.3188 1.0614 2.4652 2.7143 1.3095 1.3998 1.6068 1.8815 1.9734 4.3851 2.2780 2.1817 2.5112 2.0942 1.3239 1.5272 3.5962 6.6587 3.5158 4.4529 1.0853 1.0891 1.0875 1.0938 1.1005 1.0651 1.0627 1.0572 1.0593 1.0660 1.1040 1.1040
irintensity: 1.3126 2.2002 3.7118 4.0968 27.1069 5.0122 0.3895 0.0003 1.5096 19.8609 18.1937 12.9312 58.2484 2.1486 8.1040 68.4048 11.6888 12.0323 273.4092 317.3474 42.3103 20.7732 14.2453 6.7897 35.5802 17.2028 155.7307 96.2231 9.9282 1.5141 28.0685 2.6443 88.3478 33.9190 0.1532 99.0893 5.5493 0.1577 0.2193 0.0090 3.1404 7.6398 14.0241 129.1442 26.4280 183.8732 60.2700 2.0921 18.5107 12.7260 7.3594 8.8899 74.4227 267.4824 50.3193 21.0862 20.6880 666.5013 61.4797 311.2483 94.2623 60.8970 26.1856 8.0320 51.5187 513.9478 9.8043 12.7973 4.0828 14.7101 17.8044 31.9711 43.5970 20.0180 23.8463 26.6672 30.3281 36.9780
temp: 298.150 k
press: 1.00000 atm
elementType: 8 8 8 7 7 7 7 6 6 6 6 6 6 6 6 6 1 1 1 1 1 1 1 1 1 1 1 1
symmnumber: 1
zpe: 566951.1 jmol-1
zpe.correction: 0.215940 hartree
zpe.thermalcorrener: 0.231246 hartree
zpe.thermalcorrenthalpy: 0.232191 hartree
zpe.thermalcorrgfe: 0.172827 hartree
zpe.sumelectzpe: -793.694340 hartree
zpe.sumelectthermal: -793.679034 hartree
zpe.sumelectthermalent: -793.678089 hartree
zpe.sumelectthermalfe: -793.737453 hartree
dipole: -3.6970 -0.0302 8.6749
dipole: 9.4299
quadrupole: -87.2216 -82.6662 -83.8433
quadrupole: -0.0047 10.5708 0.0243
quadrupole: -2.6445 1.9108 0.7337 -0.0047 10.5708 0.0243
hfenergy: -793.91028 hartree
pointgroup: C01 [X(C9H12N4O3)]
dipole: 1.2630444 0.0049126 3.48839 debye
polarizability: 149.7344391|-0.0001798|112.0357754|1.1775334|0.082932|139.5714246 unknown
InChI: InChI=1S/C9H12N4O3/c10-8(15)12-7(13-9(11)16)5-3-1-2-4-6(5)14/h1-4,7,12-14H,10-11H2
charge 0 multiplicity 1
28 atoms
O  0.862856 0.002926 2.274331
O  -2.074462 2.10686 -1.434256
O  -2.055648 -2.116447 -1.437639
N  -1.181912 1.215777 0.54576
N  -1.179311 -1.216812 0.545681
N  -2.307191 3.280338 0.568248
N  -2.293525 -3.287419 0.565787
C  -0.669845 0.000155 -0.100754
C  0.861148 0.001791 -0.136375
C  1.616643 0.00307 1.063487
C  1.566233 0.001557 -1.359666
C  3.025649 0.004272 1.059236
C  2.980775 0.002764 -1.389015
C  3.709615 0.004135 -0.179307
C  -1.867861 2.188983 -0.186599
C  -1.855939 -2.195049 -0.188617
H  -1.064416 -0.000383 -1.131973
H  -0.873497 1.38956 1.504329
H  -0.873723 -1.387921 1.505632
H  0.994639 0.000318 -2.294087
H  3.588762 0.005273 2.002064
H  3.508097 0.002574 -2.348278
H  4.804748 0.005038 -0.192038
H  1.46387 0.003482 3.059156
H  -2.268873 3.314498 1.584382
H  -2.797562 4.014512 0.064453
H  -2.777145 -4.025122 0.060615
H  -2.261926 -3.318832 1.582244
