program: Gaussian 09
title: 000238941
version: EM64L-G09RevD.01
frameworkgroup: C1[X(C9H10N2O3)]
method: RPBEPBE
basis: SDD
operation: Freq
keyword: #p
keyword: freq=noraman
keyword: PBEPBE/SDD
title: #p freq=noraman PBEPBE/SDD
converged: YES YES NO NO
title: Mulliken charges:
elementType: O O O N N C C C C C C C C C H H H H H H H H H H
charge: -0.263020 -0.136572 -0.191067 -0.025678 0.006705 -0.591724 0.232096 0.122265 -0.256696 0.178025 -0.350822 -0.660147 -0.300899 -0.249706 0.291826 0.268048 0.229011 0.239672 0.257757 0.225628 0.253304 0.230591 0.244438 0.246966
chargesum: 0.00000
title: Mulliken charges with hydrogens summed into heavy atoms:
elementType: O O O N N C C C C C C C C C
charge: -0.263020 -0.136572 -0.191067 -0.025678 0.006705 -0.031850 0.232096 0.122265 0.211987 0.178025 -0.093065 0.049376 -0.056461 -0.002739
polarizability: 1.62573752e+02 1.98042960e+00 1.07242638e+02 -7.75888674e+00 4.97730232e+00 7.85373889e+01
1716.lowfreq: -9.9830 -6.1656 0.0004 0.0005 0.0006 1.2413 13.8262 23.3088 41.8595
frequency: 13.0263 23.1962 41.8469 55.0166 82.0906 96.1740 142.0529 206.9217 213.3897 293.2901 312.8118 328.2966 353.4634 397.0258 433.9003 465.1341 476.4630 585.8064 624.7909 663.1202 714.7919 752.4615 782.7371 812.4675 826.3022 839.5254 859.4923 914.0626 941.0287 960.7123 978.0240 1001.8123 1019.3236 1037.1525 1094.9538 1127.1540 1141.1326 1156.0180 1169.5554 1228.9809 1245.5207 1274.7048 1300.8824 1326.0158 1350.5533 1388.9813 1392.5097 1409.2879 1445.9888 1457.8005 1464.2752 1483.4392 1506.6109 1538.3270 1634.1996 1644.1895 2988.4028 2995.9077 3033.0630 3054.2665 3091.3728 3098.4676 3124.6720 3137.1445 3152.7370 3163.6061
redmass: 4.7837 4.7884 4.2177 5.3689 4.2723 4.2265 3.7364 3.8815 1.3089 2.4328 2.4313 5.9699 10.2252 3.4455 5.1159 5.0114 4.4630 6.7039 6.4302 4.5655 4.3874 3.6206 2.3269 1.4527 2.4520 3.5337 2.4823 1.9911 1.7055 1.5111 5.4196 2.6288 4.3963 2.7689 2.1661 2.2574 2.7958 1.6595 1.6026 2.3585 3.7359 1.1186 1.6329 1.7457 1.2667 1.7930 1.2239 1.1070 2.0933 1.0912 1.0430 1.0524 7.6036 4.8317 10.4122 10.1587 1.0650 1.0361 1.0601 1.0928 1.0974 1.1029 1.1065 1.0881 1.0926 1.0999
irintensity: 0.0281 0.1353 1.8888 0.6024 1.8524 0.3821 0.8226 3.6486 1.6057 7.3110 2.4695 1.0738 5.0474 15.6270 10.9639 4.2371 1.0741 10.7341 16.0128 5.4445 18.0856 8.3355 5.4294 8.5406 7.9033 13.5059 14.2915 6.4607 2.9873 0.1683 16.3696 14.6681 179.9122 32.7723 22.2295 100.8881 90.8712 7.9725 3.3943 5.3534 0.3388 3.9564 40.2768 47.9454 1.6839 25.0074 24.0460 36.1182 46.4342 11.9449 15.3801 13.1476 6.5217 10.0086 207.7998 10.3971 12.4084 14.3704 25.9775 4.5657 30.5810 1.3181 25.2341 1.3989 30.6309 26.8493
temp: 298.150 k
press: 1.00000 atm
elementType: 8 8 8 7 7 6 6 6 6 6 6 6 6 6 1 1 1 1 1 1 1 1 1 1
symmnumber: 1
zpe: 471738.0 jmol-1
zpe.correction: 0.179676 hartree
zpe.thermalcorrener: 0.193436 hartree
zpe.thermalcorrenthalpy: 0.194380 hartree
zpe.thermalcorrgfe: 0.135367 hartree
zpe.sumelectzpe: -683.064806 hartree
zpe.sumelectthermal: -683.051046 hartree
zpe.sumelectthermalent: -683.050101 hartree
zpe.sumelectthermalfe: -683.109115 hartree
dipole: -2.0574 -4.1683 2.0170
dipole: 5.0671
quadrupole: -66.4616 -90.5386 -81.0895
quadrupole: 1.4426 -8.6264 4.1369
quadrupole: 12.9016 -11.1754 -1.7263 1.4426 -8.6264 4.1369
hfenergy: -683.2444819 hartree
pointgroup: C01 [X(C9H10N2O3)]
dipole: 0.7250299 1.7655792 -0.575564 debye
dipolederiv: -1.043868 -0.3763179 0.1654914 -0.4872486 -1.0475095 0.1780875 0.12149 0.1054006 -0.3428789 -0.6421758 -0.1080049 0.0212915 0.0277764 -0.6557313 0.1490878 0.0091708 0.1428599 -0.2896029 -0.7251802 0.3148575 -0.0602226 -0.0565998 -0.7690584 0.1038255 0.0330831 0.063036 -0.2983238 -0.3407106 0.0208656 0.0218035 -0.0272006 -0.2408324 -0.00181 -0.0656279 0.0172321 -0.2310506 -0.2033673 0.0230943 0.0237149 0.0001554 -0.2501991 -0.0161449 0.0501692 -0.0127946 -0.2089423 -0.3749877 0.1158932 -0.0612603 0.3063647 -0.3163676 0.1222034 -0.1421709 0.1068963 0.0272434 0.711786 -0.0169592 0.1319066 0.2397598 0.0422843 0.0885657 -0.191529 0.0353506 -0.0798265 1.0415104 -0.0609887 0.0163732 -0.3566094 0.8366653 -0.2353498 0.1284845 -0.2418176 0.2493981 0.7464437 0.2878525 -0.135693 0.1714208 0.3502453 -0.034713 -0.0919735 0.0155115 0.3438596 0.7689192 -0.065163 0.0084734 0.4767371 1.4498877 -0.2420573 -0.1328097 -0.1577928 0.2465725 -0.1497709 -0.0212147 -0.0334125 -0.202776 0.0400541 -0.1163786 0.3089247 -0.0121756 0.2335559 -0.1007474 -0.070339 0.0664831 -0.0277969 0.007315 -0.0218868 0.0610808 -0.0606003 -0.1133902 -0.0683219 -0.0012446 -0.0051921 -0.0959556 0.0022342 -0.0778101 0.3366438 -0.0424105 0.2740296 0.2883577 0.0163403 0.1078595 0.108653 -0.0079909 0.0365993 -0.2175465 -0.0118314 -0.0915959 0.0628648 0.0255914 0.0203777 -0.0366602 0.1222952 0.007414 0.119224 0.0291214 0.0273085 0.0401421 -0.0069952 -0.0354872 -0.0650374 0.0755656 -0.0493878 -0.0457006 -0.0773734 0.0588384 0.014782 -0.0188561 0.0433315 -0.0515881 -0.0957965 -0.0858589 0.0203854 -0.0626819 0.0471477 -0.0367637 -0.0373533 -0.0129184 0.0704271 0.0411093 0.1040188 -0.038892 0.0493477 -0.0299918 0.0516974 0.0061637 -0.0737576 0.0278696 0.1068197 0.0354776 -0.1183589 0.01207 -0.0043995 -0.1457805 -0.0853335 0.0263186 -0.0752004 0.1042721 0.0026456 0.042853 0.0234187 0.0826404 0.135062 -0.0247077 -0.0178862 -0.0105292 -0.0835637 -0.0711609 -0.0073738 -0.0249361 0.0636378 0.0560458 0.0945817 -0.0947473 0.0801916 0.0321721 0.0787109 -0.0469195 0.0602197 -0.0185313 0.0231714 0.0071709 -0.0718761 0.018461 0.1234707 0.0409364 -0.122812 0.0343119 -0.045121 -0.1091086 -0.0189334 -0.0509715 -0.0346142 0.1326587 0.0049855 -0.0097951 0.009638 0.0994229 unknown
polarizability: 162.0878732|9.4420043|89.2553368|3.3295164|-14.6048466|97.0105686 unknown
InChI: InChI=1S/C9H10N2O3/c1-2-14-9(13)8(12)5-7-6-10-3-4-11-7/h3-4,6H,2,5H2,1H3
charge 0 multiplicity 1
24 atoms
O  2.648716 0.858192 0.199994
O  0.263925 -1.703334 0.861637
O  3.098291 -1.419615 0.500394
N  -2.182718 0.613108 -1.191325
N  -3.670528 -0.256614 1.083608
C  -0.076811 0.603016 0.062174
C  -1.569707 0.370816 0.00975
C  0.746385 -0.617646 0.472914
C  4.120374 1.152151 0.100144
C  2.293657 -0.474252 0.391323
C  -2.319753 -0.070506 1.133673
C  4.611925 0.94406 -1.334042
C  -3.534314 0.421644 -1.245074
C  -4.273289 -0.004865 -0.11774
H  0.263889 0.951054 -0.930039
H  0.185777 1.423174 0.761134
H  4.19242 2.203006 0.420776
H  4.651223 0.494861 0.811019
H  -1.834432 -0.289382 2.089392
H  5.675423 1.238148 -1.404218
H  4.529881 -0.115057 -1.62949
H  4.03699 1.562821 -2.044018
H  -4.019814 0.615616 -2.207045
H  -5.357312 -0.150095 -0.16514
