program: Gaussian 09
title: 000238951
version: EM64L-G09RevD.01
frameworkgroup: C1[X(C13H10BrNO3)]
method: RPBEPBE
basis: SDD
operation: Freq
keyword: #p
keyword: freq=noraman
keyword: PBEPBE/SDD
title: #p freq=noraman PBEPBE/SDD
converged: YES YES NO NO
title: Mulliken charges:
elementType: Br O O O N C C C C C C C C C C C C C H H H H H H H H H H
charge: 0.072670 -0.267564 -0.201542 -0.210757 0.022070 -0.414530 0.419878 0.577593 -0.471172 -0.369465 -0.416186 0.400540 -0.476240 -0.387934 -0.117698 -0.220360 -0.222641 -0.237029 0.236647 0.233461 0.314185 0.260079 0.231266 0.293720 0.258229 0.230536 0.230321 0.231925
chargesum: 0.00000
title: Mulliken charges with hydrogens summed into heavy atoms:
elementType: Br O O O N C C C C C C C C C C C C C
charge: 0.072670 -0.267564 -0.201542 -0.210757 0.022070 0.055577 0.419878 0.577593 -0.156987 -0.109386 -0.184920 0.400540 -0.476240 -0.094214 0.140530 0.010176 0.007680 -0.005104
polarizability: 2.57580943e+02 -2.38632777e+01 2.11731364e+02 3.69078157e+00 1.23695384e+01 7.54982986e+01
1716.lowfreq: -12.9597 -4.3158 -0.0001 -0.0001 0.0003 2.5300 4.0263 30.8204 42.7938
frequency: -11.7511 30.8135 42.7927 59.3244 77.2748 102.6585 124.6756 143.5436 193.3674 230.3086 238.5251 245.2437 294.0360 338.2134 400.9513 415.2681 444.4303 463.3252 490.1252 532.9234 548.7719 568.4537 611.6092 619.4493 675.2871 700.2561 702.0736 722.0330 742.9435 753.3375 820.9207 831.2804 856.0155 892.5847 894.0946 916.5347 969.8772 976.2283 980.4998 990.0081 997.4798 1010.1412 1012.9278 1028.4185 1087.0811 1090.5232 1127.7467 1174.0275 1189.1820 1204.8950 1210.7172 1222.2423 1233.1748 1255.5666 1316.8254 1352.9699 1367.2943 1388.5584 1389.1823 1415.8549 1441.6475 1454.7016 1472.5837 1487.3426 1568.2918 1596.6065 1603.9812 1618.8645 2947.8361 3014.4518 3116.7228 3131.0672 3144.5350 3159.6155 3168.9699 3170.9697 3188.0200 3196.7416
redmass: 3.8977 5.5585 8.6827 10.0355 9.1229 4.1521 9.1215 6.6104 4.7668 7.4024 4.9833 7.7147 6.5498 4.8195 2.8285 8.3476 3.2945 3.2087 7.3769 6.5322 5.7609 5.5483 6.5516 6.2722 8.0081 6.3766 2.1605 3.6146 1.6927 5.4992 4.0597 1.3800 1.2492 1.7747 3.9484 1.3821 1.3447 5.5282 1.4536 6.0068 1.3769 1.7701 5.8790 2.1679 1.5781 1.8663 1.4084 1.0538 1.1131 1.2833 6.4051 2.0830 2.9908 1.4569 1.3884 1.6589 6.4704 6.4485 5.1528 5.0506 2.1529 2.0784 1.3348 2.2829 6.6960 6.1978 8.5036 6.0350 1.0578 1.1037 1.0880 1.0868 1.0924 1.0963 1.0905 1.0998 1.0910 1.0959
irintensity: 0.3921 0.0582 0.2342 0.4363 1.5524 4.5142 3.9758 0.9388 5.6194 0.8383 1.3057 0.8013 1.6743 0.8555 1.0364 3.4188 6.3144 10.6652 4.2018 5.1433 0.0226 3.4606 4.7919 4.7170 2.7279 24.2861 32.5509 0.1636 85.2910 36.9039 5.9766 18.2272 0.2512 34.9656 13.0287 7.7696 1.6276 116.6244 7.4696 0.0818 0.4271 5.5766 75.3941 7.6707 9.5091 2.5141 11.8995 0.3297 7.4600 24.5531 331.5054 115.8246 183.5396 46.6529 12.3570 20.1555 34.6649 5.5927 150.6319 79.3809 11.7879 146.0569 7.5571 19.7011 48.0464 1.8536 58.5114 2.8082 19.9037 21.5201 8.2042 0.7850 22.5198 28.5657 2.4083 11.9369 6.1481 4.1654
temp: 298.150 k
press: 1.00000 atm
elementType: 35 8 8 8 7 6 6 6 6 6 6 6 6 6 6 6 6 6 1 1 1 1 1 1 1 1 1 1
symmnumber: 1
zpe: 527540.1 jmol-1
zpe.correction: 0.200929 hartree
zpe.thermalcorrener: 0.215850 hartree
zpe.thermalcorrenthalpy: 0.216794 hartree
zpe.thermalcorrgfe: 0.156252 hartree
zpe.sumelectzpe: -793.896044 hartree
zpe.sumelectthermal: -793.881123 hartree
zpe.sumelectthermalent: -793.880179 hartree
zpe.sumelectthermalfe: -793.940721 hartree
dipole: -3.3469 1.6556 0.0672
dipole: 3.7347
quadrupole: -116.2236 -116.4226 -115.1634
quadrupole: 20.2674 -0.8649 4.1880
quadrupole: -0.2871 -0.4861 0.7731 20.2674 -0.8649 4.1880
hfenergy: -794.0969733 hartree
pointgroup: C01 [X(C13H10Br1N1O3)]
dipole: -1.3477912 -0.5825142 -0.0552746 debye
polarizability: 259.9098846|21.369008|208.5059194|-0.9555334|16.8988923|76.3948014 unknown
InChI: InChI=1S/C13H10BrNO3/c14-12-7-6-11(15(16)17)8-13(12)18-9-10-4-2-1-3-5-10/h1-8H,9H2
charge 0 multiplicity 1
28 atoms
Br 0.175472 -3.558705 -0.033057
O  -0.566491 -0.608099 0.021605
O  5.263495 1.125849 -0.087739
O  3.455187 2.516434 -0.038353
N  3.990787 1.339917 -0.060238
C  -1.164293 0.746325 -0.018097
C  -2.672306 0.602875 -0.050984
C  0.815027 -0.709296 -0.014668
C  1.695998 0.396828 -0.02236
C  -3.292841 -0.519214 -0.652141
C  -3.475718 1.637665 0.48814
C  3.086702 0.16427 -0.05304
C  1.36797 -2.025436 -0.038196
C  3.643368 -1.129324 -0.075224
C  2.760962 -2.22937 -0.066737
C  -4.701723 -0.599271 -0.71628
C  -4.884447 1.560897 0.413849
C  -5.501761 0.441107 -0.189447
H  -0.791851 1.263538 -0.927917
H  -0.839931 1.320921 0.872245
H  1.341335 1.429368 -0.001648
H  -2.671077 -1.329183 -1.04569
H  -3.004602 2.504623 0.968569
H  4.727179 -1.259783 -0.098252
H  3.153791 -3.249663 -0.083759
H  -5.174596 -1.47389 -1.17656
H  -5.496631 2.366869 0.833146
H  -6.594206 0.377246 -0.242269
