program: Gaussian 09
title: 000238935
version: EM64L-G09RevD.01
frameworkgroup: C1[X(C7H6BrNO2)]
method: RPBEPBE
basis: SDD
operation: Freq
keyword: #p
keyword: freq=noraman
keyword: PBEPBE/SDD
title: #p freq=noraman PBEPBE/SDD
converged: YES YES NO YES
title: Mulliken charges:
elementType: Br O O N C C C C C C C H H H H H H
charge: 0.001788 -0.448754 -0.260744 -0.671807 0.262747 0.625179 -0.336335 -0.314768 -0.405577 -0.369412 0.105352 0.286464 0.274626 0.228474 0.324731 0.315755 0.382281
chargesum: 0.00000
title: Mulliken charges with hydrogens summed into heavy atoms:
elementType: Br O O N C C C C C C C
charge: 0.001788 -0.066473 -0.260744 -0.031322 0.262747 0.625179 -0.049871 -0.040141 -0.405577 -0.140938 0.105352
polarizability: 1.71947027e+02 -1.02648823e+01 1.22263264e+02 1.81507284e-03 2.42657934e-03 3.95891063e+01
1716.lowfreq: -6.2649 -0.0009 -0.0008 -0.0006 4.9912 7.4150 66.6335 104.6471 131.1427
frequency: 66.6326 104.6468 131.1419 155.4376 225.4871 261.0177 294.9743 341.4263 421.6550 429.7717 450.6042 487.2465 513.8179 527.1224 565.4803 591.9511 656.9163 701.9973 725.4676 749.5780 832.9214 843.8333 935.0229 974.8000 1002.4444 1023.3465 1037.8597 1152.2474 1162.4134 1260.1446 1318.1323 1344.8289 1378.5143 1433.8245 1511.1259 1549.4683 1614.9633 1634.9165 1644.4387 3132.5266 3167.9178 3180.7257 3536.5900 3539.2961 3687.1706
redmass: 11.2209 5.0067 11.8205 4.9236 5.3202 11.9256 4.9886 8.2222 3.7809 1.7208 1.5434 1.1941 4.9039 2.1656 5.1278 1.4662 7.3001 4.4994 5.7291 4.1667 1.5830 6.1196 1.4333 1.3607 4.5200 1.7916 2.1103 1.5028 1.3385 1.4093 1.8132 4.0198 4.4368 6.2837 3.6065 7.4731 2.3518 2.7276 3.2708 1.0899 1.0925 1.0952 1.0635 1.0469 1.1030
irintensity: 0.5859 2.4345 0.3657 1.2075 3.7006 0.2820 3.8791 4.6006 0.8902 68.2299 16.1778 242.2061 14.8309 12.1111 69.6780 102.1058 32.8356 31.2952 19.6246 28.6238 45.4704 14.2884 14.6974 0.0468 64.6442 53.8028 171.3308 227.8632 48.5575 30.3447 37.6075 168.2285 33.2432 4.8084 75.9659 16.2356 20.5527 743.8735 32.5234 13.4211 1.4371 2.7578 79.6394 82.5588 41.9476
temp: 298.150 k
press: 1.00000 atm
elementType: 35 8 8 7 6 6 6 6 6 6 6 1 1 1 1 1 1
symmnumber: 1
zpe: 312834.5 jmol-1
zpe.correction: 0.119152 hartree
zpe.thermalcorrener: 0.129313 hartree
zpe.thermalcorrenthalpy: 0.130258 hartree
zpe.thermalcorrgfe: 0.082362 hartree
zpe.sumelectzpe: -488.236556 hartree
zpe.sumelectthermal: -488.226395 hartree
zpe.sumelectthermalent: -488.225451 hartree
zpe.sumelectthermalfe: -488.273346 hartree
dipole: -1.7254 4.5077 0.0004
dipole: 4.8267
quadrupole: -61.7925 -66.5715 -76.6834
quadrupole: -2.0885 -0.0002 0.0010
quadrupole: 6.5567 1.7777 -8.3343 -2.0885 -0.0002 0.0010
hfenergy: -488.3557082 hartree
pointgroup: C01 [X(C7H6Br1N1O2)]
dipole: -1.2016797 -1.4703774 -0.000144 debye
dipolederiv: -0.3444891 0.2720446 0.0000084 0.3041494 -0.418614 -0.0000149 0.0000089 -0.0000125 -0.0331324 -1.0474062 0.5013546 0.0000101 0.7269668 -0.7629321 -0.0000145 0.0000113 -0.0000137 -0.434396 -1.0224713 -0.2886911 -0.0000061 -0.4631436 -0.935064 -0.0000146 -0.0000102 -0.000012 -0.3406342 -1.6013573 -0.3646043 0.0000258 -0.3230341 -0.2275624 0.0000345 0.000105 0.0000624 -0.6789406 -1.1815452 -0.0955807 0.0000059 -0.204251 -0.2298792 -0.0000048 -0.0000004 -0.0000046 -0.0418902 1.4626819 0.6275586 -0.0000118 0.4380018 -0.0080178 -0.0000152 -0.0000162 -0.0000191 0.180288 0.3578939 0.071668 -0.0000048 0.0131926 -0.1200227 -0.0000031 -0.0000034 -0.0000045 -0.0252109 0.3704006 0.1877581 0.0000021 0.2657722 0.1884882 0.000009 0.0000043 0.0000072 -0.0877967 0.0759517 -0.6285826 -0.0000146 -1.1246731 0.5290758 0.0000295 -0.0000439 0.0000243 -0.1888111 -0.5236256 -0.2554615 -0.0000048 0.3754125 0.0956225 0.0000093 0.0000158 0.0000123 -0.2184518 2.4598491 0.0217798 -0.000006 0.1038695 1.3152857 0.0000279 -0.0000032 0.0000283 0.2287348 0.1466208 -0.0447337 -0.0000014 -0.0019361 0.0324656 -0.0000043 0.0000011 -0.0000037 0.1561174 0.0811956 0.0731053 0.0000029 0.0664404 0.0346731 -0.0000054 0.000003 -0.0000052 0.1584793 0.0097807 -0.0702999 -0.0000019 -0.0552772 -0.0932928 -0.0000106 0.0000009 -0.0000096 0.1706855 0.2696838 0.0365965 -0.0000045 -0.031339 0.2113364 -0.0000012 -0.0000408 -0.000007 0.3733988 0.2357654 0.0466708 -0.0000009 0.0916963 0.1470454 -0.0000213 -0.0000376 -0.0000398 0.3819941 0.2510713 -0.0905824 0.0000016 -0.1818473 0.2413923 -0.0000003 0.0000053 -0.0000028 0.3995662 unknown
polarizability: 173.1658639|-6.5822366|121.0444272|-0.0009607|0.002874|39.5891063 unknown
InChI: InChI=1S/C7H6BrNO2/c8-5-3-4(7(10)11)1-2-6(5)9/h1-3,10H,9H2
charge 0 multiplicity 1
17 atoms
Br -2.638856 2.195713 0.000209
O  3.218498 -0.882319 0.000095
O  2.881925 1.417913 0.000156
N  -3.209161 -0.914128 0.00013
C  0.955413 -0.081703 0.000122
C  -1.855304 -0.639347 0.000115
C  0.013942 0.983317 0.000165
C  0.485215 -1.422576 0.000072
C  -1.353902 0.701117 0.00016
C  -0.888076 -1.694571 0.000067
C  2.391157 0.260081 0.000131
H  0.383102 2.013324 0.000198
H  1.211669 -2.239472 0.000037
H  -1.244479 -2.731285 0.000029
H  -3.887716 -0.154849 0.000112
H  -3.543525 -1.873544 0.000021
H  4.165399 -0.57897 0.000079
