program: Gaussian 09
title: 000238947
version: EM64L-G09RevD.01
frameworkgroup: C1[X(C12H8I2S2)]
method: RPBEPBE
basis: SDD
operation: Freq
keyword: #p
keyword: freq=noraman
keyword: PBEPBE/SDD
title: #p freq=noraman PBEPBE/SDD
converged: YES YES NO NO
title: Mulliken charges:
elementType: I I S S C C C C C C C C C C C C H H H H H H H H
charge: 0.123388 0.123288 0.067584 0.067605 -0.239184 -0.238979 -0.180131 -0.181850 -0.181308 -0.178969 -0.147717 -0.147524 -0.154343 -0.154606 -0.338184 -0.337933 0.265428 0.265530 0.270517 0.270482 0.255948 0.256004 0.257446 0.257509
chargesum: 0.00000
title: Mulliken charges with hydrogens summed into heavy atoms:
elementType: I I S S C C C C C C C C C C C C
charge: 0.123388 0.123288 0.067584 0.067605 -0.239184 -0.238979 0.085297 0.083680 0.089209 0.091513 0.108231 0.108480 0.103103 0.102903 -0.338184 -0.337933
polarizability: 3.40427432e+02 -6.15703735e-01 2.50603076e+02 -1.80204066e+01 -4.48989691e-01 1.11149310e+02
1716.lowfreq: -5.4143 -3.4548 -0.0016 -0.0006 0.0004 0.7230 6.8947 20.1978 27.3078
frequency: 6.7651 20.1038 27.2693 41.3779 49.0282 88.4719 125.5243 163.2731 172.1030 211.3628 213.4481 261.2079 296.6613 306.7350 311.0902 370.6026 403.4757 404.3628 445.3366 446.6515 495.0262 496.1432 616.2141 616.3345 695.8043 696.7838 702.7659 703.4833 830.5597 831.0350 831.2080 834.5919 962.3163 963.0924 974.7610 975.4829 981.4987 982.8193 1042.0995 1043.8209 1067.0329 1071.8778 1100.5949 1101.2821 1185.3374 1186.7178 1283.8572 1284.3256 1348.8178 1349.0464 1373.6073 1374.5100 1444.4292 1445.8431 1556.6406 1557.1123 1558.8486 1560.0523 3152.6889 3152.9322 3154.2084 3154.2780 3172.2489 3172.5267 3176.6583 3176.8827
redmass: 27.4069 3.9427 4.4101 11.3283 8.5291 8.6254 10.8989 10.3042 9.8969 17.3585 18.7251 7.5363 5.7297 6.2778 5.2796 17.2726 2.8532 2.8575 9.6858 9.1861 3.2823 3.2537 7.1328 7.1358 6.6725 6.4164 4.2162 4.2710 1.4278 1.4185 1.2542 1.2532 1.3290 1.3285 1.3850 1.3825 6.7782 6.7479 5.8171 4.8333 2.0160 2.1633 1.4235 1.4211 1.1174 1.1171 1.2383 1.2378 4.0779 4.3728 3.8702 4.1032 2.0698 2.0837 7.0130 7.5050 6.6507 6.2478 1.0889 1.0888 1.0889 1.0889 1.0968 1.0967 1.0979 1.0979
irintensity: 0.0032 0.0577 0.0413 0.0733 0.0248 0.2548 0.3010 0.5045 0.5199 1.3200 6.4409 4.8898 1.5860 3.5554 1.4342 2.8523 0.0598 0.0131 1.0588 7.6630 12.2788 47.2931 0.2167 0.1349 19.1400 14.6025 10.3651 8.5666 55.2296 64.5884 0.5598 0.6677 0.0288 0.0887 0.0587 0.0846 111.9351 60.2826 30.5574 47.5428 1.0523 0.2835 5.5296 2.8479 11.6104 0.0062 0.1435 0.0400 1.0776 0.4817 10.4045 21.0051 42.4986 51.9986 29.8905 4.1526 45.3218 84.6163 0.9953 0.0388 0.5555 0.5970 8.4314 5.4409 2.4014 0.8168
temp: 298.150 k
press: 1.00000 atm
elementType: 53 53 16 16 6 6 6 6 6 6 6 6 6 6 6 6 1 1 1 1 1 1 1 1
symmnumber: 1
zpe: 417515.0 jmol-1
zpe.correction: 0.159023 hartree
zpe.thermalcorrener: 0.175231 hartree
zpe.thermalcorrenthalpy: 0.176175 hartree
zpe.thermalcorrgfe: 0.107524 hartree
zpe.sumelectzpe: -1280.085713 hartree
zpe.sumelectthermal: -1280.069505 hartree
zpe.sumelectthermalent: -1280.068561 hartree
zpe.sumelectthermalfe: -1280.137212 hartree
dipole: -0.0082 -0.8890 -0.0027
dipole: 0.8891
quadrupole: -132.2754 -138.6939 -139.0627
quadrupole: -0.1702 -6.1296 -0.1719
quadrupole: 4.4020 -2.0166 -2.3853 -0.1702 -6.1296 -0.1719
hfenergy: -1280.2447361 hartree
pointgroup: C01 [X(C12H8I2S2)]
dipole: 0.0038945 0.3490048 -0.0230364 debye
dipolederiv: -0.3551202 -0.2687996 -0.0520632 -0.4045378 -0.3112912 -0.0438087 -0.0910886 -0.0583738 -0.0069808 -0.3270671 0.2594276 -0.0846432 0.3894563 -0.3201154 0.0875004 -0.1412044 0.1050716 -0.0263534 0.1308526 0.3462277 -0.0980031 0.429845 0.0507357 0.0731567 0.143032 -0.0190839 -0.0184763 0.0933621 -0.3585241 -0.0560126 -0.4145698 0.0847233 -0.0807963 0.1874965 -0.0000633 -0.0075509 0.0096852 0.0720038 0.0667282 -0.0692249 -0.1333169 -0.0181284 -0.0601266 -0.1855395 -0.0979615 0.005373 -0.0651619 0.0776579 0.058368 -0.1064378 0.0166193 -0.0646371 0.1930876 -0.126904 0.1084646 0.1517351 -0.0083125 -0.2140544 0.0272436 -0.0819711 0.1884925 0.0588724 -0.0514736 0.1121206 -0.1557657 0.017672 0.2381834 0.0277375 0.0667143 0.1541771 -0.0803005 -0.0547479 -0.1202899 -0.1006905 0.0937715 0.2807663 0.0670559 0.0405634 -0.0909185 -0.0784693 -0.0318233 -0.1198931 0.122371 0.0728468 -0.2832774 0.0769131 -0.0574664 -0.0471694 0.0655706 -0.0373821 -0.2142635 -0.3049214 0.0823525 -0.3294295 -0.3894856 0.0258445 0.0272754 -0.0866965 -0.0420306 -0.1792315 0.3063634 0.0361828 0.319283 -0.4039089 0.0208731 -0.0162126 0.1318701 -0.0613352 -0.4548827 -0.1808073 -0.0709308 -0.3720963 -0.185427 -0.1572323 -0.1144615 -0.0807545 -0.0669078 -0.4363621 0.1820688 -0.0849407 0.3697129 -0.1730944 0.168703 -0.1614953 0.0974626 -0.1031436 0.6857647 0.6514158 0.2057519 0.8342191 0.7310771 0.0905121 0.2486734 0.1029585 -0.0539022 0.6286451 -0.6097439 0.2836848 -0.7839125 0.7528304 -0.2094365 0.3528576 -0.2249854 -0.016702 0.1137446 -0.0405154 -0.0265747 0.0065758 -0.0173115 0.0579677 -0.0223819 0.0458038 0.0999481 0.1129532 0.0279643 -0.0341044 -0.0178288 -0.0309629 -0.0361741 -0.0213245 -0.0247293 0.1146278 0.0105166 -0.0005084 -0.0906695 0.0007336 0.0554006 -0.0003228 -0.091828 0.0190395 0.0829871 0.0057358 -0.0115786 -0.0879099 -0.0125771 0.0533545 0.009145 -0.0897524 -0.0101172 0.0875498 -0.0039269 0.0053218 -0.093018 -0.0153275 0.0993256 0.0215761 -0.1044902 0.0275244 0.0873578 -0.0091767 -0.0155705 -0.0904244 0.003572 0.0926479 -0.0175214 -0.1051399 -0.0219046 0.0994962 0.1024796 0.0071769 -0.0290412 -0.0229072 -0.0149296 0.0767467 -0.0378969 0.0608765 0.1061515 0.1005158 -0.0194889 -0.03 0.0090279 -0.032764 -0.0530641 -0.0418769 -0.0371201 0.125557 unknown
polarizability: 335.8969541|1.3956904|249.8287631|36.5924665|-10.3172928|116.4541 unknown
InChI: InChI=1S/C12H8I2S2/c13-9-1-5-11(6-2-9)15-16-12-7-3-10(14)4-8-12/h1-8H
charge 0 multiplicity 1
24 atoms
I  5.068378 2.543371 0.374876
I  -4.955277 2.679471 -0.729303
S  0.674947 -2.519375 -0.753635
S  -0.776275 -2.366901 1.077067
C  1.836491 -1.147733 -0.407006
C  -1.880397 -1.007019 0.548502
C  2.959669 -1.353163 0.43212
C  -3.036194 -1.282034 -0.223785
C  1.634639 0.113681 -1.020695
C  -1.602272 0.321659 0.955785
C  3.879532 -0.306028 0.65934
C  -3.913321 -0.237165 -0.588891
C  2.552126 1.167218 -0.802931
C  -2.474612 1.374386 0.59631
C  3.666024 0.946774 0.037919
C  -3.62231 1.083816 -0.175161
H  3.113743 -2.328463 0.904072
H  -3.248589 -2.309064 -0.536519
H  0.766766 0.269437 -1.669101
H  -0.710245 0.5306 1.554731
H  4.746637 -0.469069 1.305457
H  -4.806435 -0.453795 -1.181608
H  2.39527 2.136918 -1.28349
H  -2.258495 2.397376 0.916546
