program: Gaussian 09
title: 000238949
version: EM64L-G09RevD.01
frameworkgroup: C1[X(C12H16O4)]
method: RPBEPBE
basis: SDD
operation: Freq
keyword: #pfreq=noraman
keyword: PBEPBE/SDD
title: #p freq=noraman PBEPBE/SDD
converged: YES YES NO NO
title: Mulliken charges:
elementType: O O O O C C C C C C C C C C C C H H H H H H H H H H H H H H H H
charge: -0.232915 -0.437344 -0.489742 -0.463276 -0.381011 -0.361063 -0.529005 -0.348888 0.114969 0.406737 -0.698709 -0.558209 -0.497998 0.217994 0.252984 -0.019551 0.216794 0.191736 0.231028 0.175115 0.240744 0.228518 0.186608 0.199922 0.212896 0.207191 0.213800 0.278120 0.270989 0.386682 0.381398 0.403487
chargesum: 0.00000
title: Mulliken charges with hydrogens summed into heavy atoms:
elementType: O O O O C C C C C C C C C C C C
charge: -0.232915 -0.050661 -0.108344 -0.059788 0.027519 0.045079 -0.059743 0.037642 0.114969 0.406737 -0.064822 -0.280089 -0.227008 0.217994 0.252984 -0.019551
polarizability: 2.14977829e+02 2.65672335e+00 1.48792711e+02 -1.63829071e+01 -2.80967252e+00 8.93691366e+01
1716.lowfreq: -16.7445 -7.0405 -3.7384 -0.0005 -0.0002 0.0002 20.8002 26.3178 56.1416
frequency: 20.1830 25.2011 56.0892 70.0499 106.8390 112.8282 136.0909 164.8162 182.6529 223.7824 239.8074 250.8202 258.1499 273.7681 288.4239 290.6510 330.5203 381.1651 384.8301 441.0161 456.2711 469.8747 495.3696 516.4588 534.7017 559.0456 604.7220 634.5560 659.6116 728.0473 729.7992 746.0075 795.9316 840.2575 865.9766 867.4698 882.7572 918.5034 932.2545 984.1647 996.6959 1029.0295 1061.3192 1078.1548 1100.7837 1104.0456 1116.7146 1160.3915 1179.2366 1196.4757 1207.4823 1218.8985 1242.5469 1270.7489 1277.9220 1284.9150 1291.8626 1327.7867 1336.9256 1357.7136 1373.4670 1385.4958 1420.6963 1432.6636 1452.3183 1466.6235 1467.9955 1475.7765 1476.4509 1487.4306 1522.3804 1573.7137 1623.0790 1626.7093 2956.3757 2961.3416 2964.8190 2970.8072 2981.8091 3006.6745 3013.8330 3029.8474 3052.7752 3068.0130 3070.3012 3137.9653 3181.1519 3533.4039 3552.3257 3624.4460
redmass: 5.0193 3.7051 1.8393 3.3471 5.8269 3.9877 3.0174 7.2890 2.5848 1.2810 2.3661 4.2135 4.4701 3.9831 5.1472 1.3806 3.0040 7.6348 2.3845 4.1281 1.1149 1.1411 3.1517 8.3533 6.3964 4.9038 3.9729 3.4180 2.8701 3.0621 1.4038 2.6943 1.5173 1.8664 1.5277 3.4420 1.6579 1.8332 1.4697 4.5507 2.7861 2.7286 2.1277 1.7916 2.0713 1.9079 1.4937 2.0851 1.3532 1.4084 1.4564 1.4804 2.1835 1.2783 1.5904 1.4633 1.0780 1.6572 1.4331 1.6097 2.8775 1.2191 4.5832 1.1668 1.0866 1.0748 4.1196 1.0470 1.0656 1.0810 3.8647 8.2092 7.6704 7.1312 1.0621 1.0607 1.0615 1.0362 1.0629 1.0951 1.0973 1.0971 1.1026 1.1003 1.0999 1.0917 1.0918 1.0652 1.0653 1.0666
irintensity: 0.7945 0.6999 0.2907 2.9851 0.0713 1.5364 3.3653 0.3670 2.3513 0.5611 1.0791 0.8862 0.4329 16.0843 12.2419 146.4477 23.1428 0.1960 0.1593 8.1858 324.1735 0.5938 0.4335 0.2546 2.1395 0.4675 23.7128 3.0195 7.9560 6.3831 26.6738 42.0711 1.9009 30.1064 4.3610 25.8878 27.5240 6.5641 5.2676 227.8076 1.6840 1.7080 0.7361 1.2244 113.4504 5.6158 32.0886 191.1488 104.5759 5.4239 67.3964 16.8076 101.7132 7.0347 202.1470 184.7169 8.9592 5.6126 0.8495 8.4313 219.8748 10.7270 12.4738 22.7292 15.5275 0.0908 29.7070 10.7942 5.0618 15.7005 54.3546 201.3511 34.6042 27.8542 6.8591 37.8033 61.9758 38.2853 42.1828 8.4285 17.9425 10.6443 26.7112 85.7356 73.0913 9.4743 0.8054 80.0737 135.3781 63.8942
temp: 298.150 k
press: 1.00000 atm
elementType: 8 8 8 8 6 6 6 6 6 6 6 6 6 6 6 6 1 1 1 1 1 1 1 1 1 1 1 1 1 1 1 1
symmnumber: 1
zpe: 677025.4 jmol-1
zpe.correction: 0.257865 hartree
zpe.thermalcorrener: 0.274996 hartree
zpe.thermalcorrenthalpy: 0.275940 hartree
zpe.thermalcorrgfe: 0.211661 hartree
zpe.sumelectzpe: -766.550949 hartree
zpe.sumelectthermal: -766.533819 hartree
zpe.sumelectthermalent: -766.532875 hartree
zpe.sumelectthermalfe: -766.597153 hartree
dipole: -2.3052 0.9433 0.3868
dipole: 2.5206
quadrupole: -86.8663 -90.2112 -98.4402
quadrupole: -12.8821 -0.8162 1.8153
quadrupole: 4.9729 1.6280 -6.6010 -12.8821 -0.8162 1.8153
hfenergy: -766.8088147 hartree
pointgroup: C01 [X(C12H16O4)]
dipole: 0.9297321 0.0799572 0.3356224 debye
polarizability: 216.3762786|6.8854978|87.7274979|-5.4465534|-3.7166609|149.0358996 unknown
InChI: InChI=1S/C12H16O4/c1-2-3-4-5-9(13)8-6-10(14)12(16)11(15)7-8/h6-7,14-16H,2-5H2,1H3
charge 0 multiplicity 1
32 atoms
O  -1.341736 -1.004101 1.213049
O  3.166592 -0.01943 -2.778439
O  3.736115 -0.349391 1.971534
O  4.76555 0.0021 -0.531256
C  -3.27864 -0.888527 -0.855768
C  -3.85893 0.416153 -0.263192
C  -1.774512 -0.799082 -1.183461
C  -5.37039 0.312973 0.041632
C  -0.867674 -0.802861 0.053585
C  0.606693 -0.585154 -0.130129
C  -5.953137 1.61422 0.634242
C  1.420876 -0.57986 1.03766
C  1.193973 -0.395861 -1.409572
C  2.583841 -0.203281 -1.522225
C  2.802224 -0.38415 0.911755
C  3.389723 -0.196017 -0.360118
H  -3.442338 -1.712985 -0.135615
H  -3.831589 -1.146424 -1.781618
H  -3.314938 0.66384 0.668353
H  -3.686336 1.254059 -0.972177
H  -1.466301 -1.65377 -1.821992
H  -1.566616 0.111654 -1.781076
H  -5.916211 0.050828 -0.888404
H  -5.538894 -0.524366 0.749001
H  -5.442198 1.879673 1.578894
H  -5.82432 2.461658 -0.065783
H  -7.033158 1.51475 0.849564
H  0.931306 -0.732613 2.006822
H  0.598655 -0.396859 -2.325552
H  4.146986 0.099542 -2.672488
H  3.303208 -0.493241 2.846583
H  5.214872 -0.012676 0.35319
