program: Gaussian 09
title: 000238930
version: EM64L-G09RevD.01
frameworkgroup: C1[X(C12H12N6)]
method: RPBEPBE
basis: SDD
operation: Freq
keyword: #pfreq=noraman
keyword: PBEPBE/SDD
title: #p freq=noraman PBEPBE/SDD
converged: YES YES NO NO
title: Mulliken charges:
elementType: N N N N N N C C C C C C C C C C C C H H H H H H H H H H H H
charge: -0.172981 -0.087250 -0.098598 -0.117074 -0.623496 -0.594199 -0.574371 0.198704 -0.136772 0.509690 -0.229546 0.187023 -0.439199 -0.360154 -0.021980 -0.217548 -0.226424 -0.238872 0.260225 0.228507 0.262809 0.229038 0.262017 0.226971 0.227847 0.229900 0.324258 0.342394 0.322781 0.326303
chargesum: 0.00000
title: Mulliken charges with hydrogens summed into heavy atoms:
elementType: N N N N N N C C C C C C C C C C C C
charge: -0.172981 -0.087250 -0.098598 -0.117074 0.043155 0.054885 -0.085639 0.198704 -0.136772 0.509690 0.033263 0.187023 -0.210161 -0.098137 -0.021980 0.009423 0.001423 -0.008973
polarizability: 2.25728202e+02 -2.01072502e+01 1.68230506e+02 -1.31220265e+01 4.38610378e+00 1.15593494e+02
1716.lowfreq: -6.8667 -0.0004 -0.0003 0.0006 2.4277 7.3797 13.8910 29.3853 40.6115
frequency: 9.4944 29.2041 40.5970 109.2331 147.4122 158.4677 205.8084 226.6569 260.8767 271.8995 316.4233 356.2028 368.7127 403.1305 416.1064 458.6776 484.2611 485.7833 515.8681 525.5162 538.7998 576.1741 606.8313 617.5645 623.2180 644.8581 666.7311 701.0628 714.6185 717.2869 769.3912 777.4776 799.4015 809.6265 814.0595 856.2639 909.6910 917.5866 957.3459 979.7392 990.0824 999.0378 1013.6773 1026.6232 1033.4700 1084.6934 1126.9472 1146.6052 1173.2054 1185.5496 1189.8038 1212.3810 1255.2481 1285.5214 1304.6039 1336.7285 1342.5615 1362.7317 1382.3907 1388.2844 1433.6051 1444.3342 1458.4197 1465.5274 1484.8853 1496.1958 1569.0289 1583.5887 1596.3014 1598.1911 1615.5165 1631.7097 3006.1459 3063.4220 3113.8505 3125.0722 3136.0013 3147.5801 3164.1438 3231.1319 3544.6524 3568.5052 3700.5404 3728.9040
redmass: 4.4400 4.4197 5.5211 5.7750 5.8434 4.3449 4.7767 6.4171 3.5150 4.4329 2.7034 3.7323 3.7210 2.8072 1.2049 3.5452 7.1759 1.2280 1.0465 5.5097 1.0698 4.6361 4.1454 5.8170 4.8726 5.6520 6.9998 3.0910 3.6634 2.6296 2.7356 2.4783 2.9267 7.5701 3.4530 1.2469 2.2434 1.6240 1.9212 1.3893 6.1342 1.3271 4.5278 2.3033 2.7485 1.6337 2.0706 1.8568 1.0556 1.8610 1.1340 2.7100 3.9848 3.6541 1.9459 1.4285 4.5537 1.4671 8.6756 5.7119 3.1675 2.2400 4.0273 1.3506 2.3131 2.5869 2.4432 5.6313 6.0302 1.4639 5.9383 2.4377 1.0593 1.1041 1.0880 1.0863 1.0914 1.0962 1.1015 1.0980 1.0441 1.0439 1.1057 1.1060
irintensity: 0.0035 0.0697 0.4119 1.3742 8.0561 3.9431 7.1645 1.9848 6.2142 3.7680 3.9957 3.7507 0.9019 0.1491 248.9042 6.8343 3.2339 301.5046 21.1218 6.8245 0.2268 1.5471 5.9296 0.4550 7.0018 36.6259 2.1041 6.3760 54.5465 64.9287 10.4102 41.0230 1.6820 2.1603 4.9396 0.0090 8.0183 2.2039 13.6856 0.0355 0.1555 0.7174 10.3012 6.3074 7.8981 11.4212 1.2962 8.8108 0.1130 23.9841 1.1389 4.7605 41.1012 13.6489 43.4551 25.6808 44.7995 19.7684 57.0265 24.6861 54.2892 4.0580 76.7382 50.0459 18.0905 113.2635 110.9272 251.6087 0.4405 534.8243 14.7849 510.6353 31.1215 6.7015 9.6222 0.0822 10.5883 32.2279 26.2259 0.0186 110.4663 112.1492 45.3189 43.9523
temp: 298.150 k
press: 1.00000 atm
elementType: 7 7 7 7 7 7 6 6 6 6 6 6 6 6 6 6 6 6 1 1 1 1 1 1 1 1 1 1 1 1
symmnumber: 1
zpe: 613298.2 jmol-1
zpe.correction: 0.233593 hartree
zpe.thermalcorrener: 0.248431 hartree
zpe.thermalcorrenthalpy: 0.249375 hartree
zpe.thermalcorrgfe: 0.189416 hartree
zpe.sumelectzpe: -791.757849 hartree
zpe.sumelectthermal: -791.743011 hartree
zpe.sumelectthermalent: -791.742067 hartree
zpe.sumelectthermalfe: -791.802026 hartree
dipole: 0.7749 0.8694 -0.2843
dipole: 1.1988
quadrupole: -86.1863 -96.8478 -101.1948
quadrupole: -5.2592 -4.9609 2.0733
quadrupole: 8.5566 -2.1048 -6.4518 -5.2592 -4.9609 2.0733
hfenergy: -791.9914422 hartree
pointgroup: C01 [X(C12H12N6)]
dipole: -0.325794 -0.3079155 -0.1466305 debye
polarizability: 223.0421039|-24.8044462|171.4114661|9.940562|1.1219526|115.0986317 unknown
InChI: InChI=1S/C12H12N6/c13-10-9-11(17-12(14)16-10)18(7-15-9)6-8-4-2-1-3-5-8/h1-5,7H,6,13-14H2
charge 0 multiplicity 1
30 atoms
N  -0.00965 0.904058 -0.705397
N  1.482432 2.175325 0.494106
N  1.283707 -1.203949 -0.868444
N  3.486015 -1.019044 0.245136
N  4.206149 0.94871 1.329662
N  2.807991 -2.987659 -0.814619
C  -1.231626 0.498759 -1.427307
C  1.101619 0.086607 -0.476504
C  2.01158 0.890105 0.259744
C  -2.400122 0.156325 -0.507304
C  0.273761 2.14178 -0.094188
C  3.24785 0.273787 0.617862
C  -3.626466 0.856127 -0.60741
C  -2.273731 -0.885731 0.44733
C  2.509575 -1.685822 -0.469085
C  -4.714617 0.524056 0.233332
C  -3.35739 -1.215723 1.288981
C  -4.581577 -0.512204 1.184603
H  -0.94279 -0.384262 -2.026964
H  -1.514375 1.30747 -2.125102
H  -0.436229 2.965936 -0.111175
H  -3.733806 1.662503 -1.344202
H  -1.327132 -1.433908 0.523501
H  -5.659245 1.072719 0.147342
H  -3.250866 -2.021554 2.023908
H  -5.422153 -0.770232 1.838477
H  5.075066 0.476768 1.567949
H  4.034978 1.911399 1.611091
H  2.132754 -3.526574 -1.348277
H  3.7051 -3.375669 -0.539645
